Message: Error installation geant4.10.02 on scientific linux 6.6 Not Logged In (login)
 Next-in-Thread Next-in-Thread
 Next-in-Forum Next-in-Forum

Question Error installation geant4.10.02 on scientific linux 6.6  

Forum: Installation and Configuration
Date: 19 Dec, 2015
From: Rassoul Jamshidzehi <Rassoul Jamshidzehi>

I haven't had any problem to installing geant4.10.01 and before. But I have a problem for installatin of geant4.10.02 on scientific linux 6.6.
When I run this command in terminal "cmake -DCMAKE_INSTALL_PREFIX=/home/local1/Geant4 -DGEANT4_USE_OPENGL_X11=ON -DGEANT4_USE_QT=ON -DGEANT4_BUILD_MULTITHREADED=ON /home/local1/geant4.10.02"
the output on terminal is:
-- Check for working CXX compiler: /usr/bin/c++ -- works
-- Detecting CXX compiler ABI info
-- Detecting CXX compiler ABI info - done
-- Detecting CXX compile features
-- Detecting CXX compile features - done
-- Performing Test HAVE_TLS
-- Performing Test HAVE_TLS - Success
-- Found EXPAT: /usr/lib64/libexpat.so (found version "2.0.1") 
-- Looking for Q_WS_X11
-- Looking for Q_WS_X11 - found
-- Looking for Q_WS_WIN
-- Looking for Q_WS_WIN - not found
-- Looking for Q_WS_QWS
-- Looking for Q_WS_QWS - not found
-- Looking for Q_WS_MAC
-- Looking for Q_WS_MAC - not found
-- Found Qt4: /usr/local/Qt/4.8.6/bin/qmake (found version "4.8.6") 
-- Found OpenGL: /usr/lib64/libGL.so  
-- Looking for XOpenDisplay in /usr/lib64/libX11.so;/usr/lib64/libXext.so
-- Looking for XOpenDisplay in /usr/lib64/libX11.so;/usr/lib64/libXext.so - found
-- Looking for gethostbyname
-- Looking for gethostbyname - found
-- Looking for connect
-- Looking for connect - found
-- Looking for remove
-- Looking for remove - found
-- Looking for shmat
-- Looking for shmat - found
-- Looking for IceConnectionNumber in ICE
-- Looking for IceConnectionNumber in ICE - found
-- Found X11: /usr/lib64/libX11.so
CMake Error at cmake/Modules/Geant4MacroLibraryTargets.cmake:111 (target_compile_features):
  The compiler feature "cxx_alias_templates" is not known to CXX compiler

  "GNU"

  version 4.4.7.
Call Stack (most recent call first):
  cmake/Modules/Geant4MacroLibraryTargets.cmake:300 (GEANT4_LIBRARY_TARGET)
  source/analysis/CMakeLists.txt:30 (GEANT4_GLOBAL_LIBRARY_TARGET)

CMake Error at cmake/Modules/Geant4MacroLibraryTargets.cmake:111 (target_compile_features):
  The compiler feature "cxx_alias_templates" is not known to CXX compiler

  "GNU"

  version 4.4.7.
Call Stack (most recent call first):
  cmake/Modules/Geant4MacroLibraryTargets.cmake:300 (GEANT4_LIBRARY_TARGET)
  source/digits_hits/CMakeLists.txt:27 (GEANT4_GLOBAL_LIBRARY_TARGET)

CMake Error at cmake/Modules/Geant4MacroLibraryTargets.cmake:111 (target_compile_features):
  The compiler feature "cxx_alias_templates" is not known to CXX compiler

  "GNU"

  version 4.4.7.
Call Stack (most recent call first):
  cmake/Modules/Geant4MacroLibraryTargets.cmake:300 (GEANT4_LIBRARY_TARGET)
  source/error_propagation/CMakeLists.txt:18 (GEANT4_GLOBAL_LIBRARY_TARGET)

CMake Error at cmake/Modules/Geant4MacroLibraryTargets.cmake:111 (target_compile_features):
  The compiler feature "cxx_alias_templates" is not known to CXX compiler

  "GNU"

  version 4.4.7.
Call Stack (most recent call first):
  cmake/Modules/Geant4MacroLibraryTargets.cmake:300 (GEANT4_LIBRARY_TARGET)
  source/event/CMakeLists.txt:22 (GEANT4_GLOBAL_LIBRARY_TARGET)

CMake Error at cmake/Modules/Geant4MacroLibraryTargets.cmake:111 (target_compile_features):
  The compiler feature "cxx_alias_templates" is not known to CXX compiler

  "GNU"

  version 4.4.7.
Call Stack (most recent call first):
  source/externals/clhep/CMakeLists.txt:229 (GEANT4_LIBRARY_TARGET)

-- Looking for sys/types.h
-- Looking for sys/types.h - found
-- Looking for stdint.h
-- Looking for stdint.h - found
-- Looking for stddef.h
-- Looking for stddef.h - found
-- Check size of off64_t
-- Check size of off64_t - done
-- Looking for fseeko
-- Looking for fseeko - found
-- Looking for unistd.h
-- Looking for unistd.h - found
CMake Error at cmake/Modules/Geant4MacroLibraryTargets.cmake:111 (target_compile_features):
  The compiler feature "cxx_alias_templates" is not known to CXX compiler

  "GNU"

  version 4.4.7.
Call Stack (most recent call first):
  cmake/Modules/Geant4MacroLibraryTargets.cmake:300 (GEANT4_LIBRARY_TARGET)
  source/externals/zlib/CMakeLists.txt:20 (GEANT4_GLOBAL_LIBRARY_TARGET)

CMake Error at cmake/Modules/Geant4MacroLibraryTargets.cmake:111 (target_compile_features):
  The compiler feature "cxx_alias_templates" is not known to CXX compiler

  "GNU"

  version 4.4.7.
Call Stack (most recent call first):
  cmake/Modules/Geant4MacroLibraryTargets.cmake:300 (GEANT4_LIBRARY_TARGET)
  source/geometry/CMakeLists.txt:28 (GEANT4_GLOBAL_LIBRARY_TARGET)

CMake Error at cmake/Modules/Geant4MacroLibraryTargets.cmake:111 (target_compile_features):
  The compiler feature "cxx_alias_templates" is not known to CXX compiler

  "GNU"

  version 4.4.7.
Call Stack (most recent call first):
  cmake/Modules/Geant4MacroLibraryTargets.cmake:300 (GEANT4_LIBRARY_TARGET)
  source/global/CMakeLists.txt:26 (GEANT4_GLOBAL_LIBRARY_TARGET)

CMake Error at cmake/Modules/Geant4MacroLibraryTargets.cmake:111 (target_compile_features):
  The compiler feature "cxx_alias_templates" is not known to CXX compiler

  "GNU"

  version 4.4.7.
Call Stack (most recent call first):
  cmake/Modules/Geant4MacroLibraryTargets.cmake:300 (GEANT4_LIBRARY_TARGET)
  source/graphics_reps/CMakeLists.txt:18 (GEANT4_GLOBAL_LIBRARY_TARGET)

CMake Error at cmake/Modules/Geant4MacroLibraryTargets.cmake:111 (target_compile_features):
  The compiler feature "cxx_alias_templates" is not known to CXX compiler

  "GNU"

  version 4.4.7.
Call Stack (most recent call first):
  cmake/Modules/Geant4MacroLibraryTargets.cmake:300 (GEANT4_LIBRARY_TARGET)
  source/intercoms/CMakeLists.txt:18 (GEANT4_GLOBAL_LIBRARY_TARGET)

CMake Error at cmake/Modules/Geant4MacroLibraryTargets.cmake:111 (target_compile_features):
  The compiler feature "cxx_alias_templates" is not known to CXX compiler

  "GNU"

  version 4.4.7.
Call Stack (most recent call first):
  cmake/Modules/Geant4MacroLibraryTargets.cmake:300 (GEANT4_LIBRARY_TARGET)
  source/interfaces/CMakeLists.txt:21 (GEANT4_GLOBAL_LIBRARY_TARGET)

CMake Error at cmake/Modules/Geant4MacroLibraryTargets.cmake:111 (target_compile_features):
  The compiler feature "cxx_alias_templates" is not known to CXX compiler

  "GNU"

  version 4.4.7.
Call Stack (most recent call first):
  cmake/Modules/Geant4MacroLibraryTargets.cmake:300 (GEANT4_LIBRARY_TARGET)
  source/materials/CMakeLists.txt:18 (GEANT4_GLOBAL_LIBRARY_TARGET)

CMake Error at cmake/Modules/Geant4MacroLibraryTargets.cmake:111 (target_compile_features):
  The compiler feature "cxx_alias_templates" is not known to CXX compiler

  "GNU"

  version 4.4.7.
Call Stack (most recent call first):
  cmake/Modules/Geant4MacroLibraryTargets.cmake:300 (GEANT4_LIBRARY_TARGET)
  source/parameterisations/CMakeLists.txt:19 (GEANT4_GLOBAL_LIBRARY_TARGET)

CMake Error at cmake/Modules/Geant4MacroLibraryTargets.cmake:111 (target_compile_features):
  The compiler feature "cxx_alias_templates" is not known to CXX compiler

  "GNU"

  version 4.4.7.
Call Stack (most recent call first):
  cmake/Modules/Geant4MacroLibraryTargets.cmake:300 (GEANT4_LIBRARY_TARGET)
  source/particles/CMakeLists.txt:29 (GEANT4_GLOBAL_LIBRARY_TARGET)

CMake Error at cmake/Modules/Geant4MacroLibraryTargets.cmake:111 (target_compile_features):
  The compiler feature "cxx_alias_templates" is not known to CXX compiler

  "GNU"

  version 4.4.7.
Call Stack (most recent call first):
  cmake/Modules/Geant4MacroLibraryTargets.cmake:300 (GEANT4_LIBRARY_TARGET)
  source/persistency/CMakeLists.txt:35 (GEANT4_GLOBAL_LIBRARY_TARGET)

CMake Error at cmake/Modules/Geant4MacroLibraryTargets.cmake:111 (target_compile_features):
  The compiler feature "cxx_alias_templates" is not known to CXX compiler

  "GNU"

  version 4.4.7.
Call Stack (most recent call first):
  cmake/Modules/Geant4MacroLibraryTargets.cmake:300 (GEANT4_LIBRARY_TARGET)
  source/physics_lists/CMakeLists.txt:22 (GEANT4_GLOBAL_LIBRARY_TARGET)

CMake Error at cmake/Modules/Geant4MacroLibraryTargets.cmake:111 (target_compile_features):
  The compiler feature "cxx_alias_templates" is not known to CXX compiler

  "GNU"

  version 4.4.7.
Call Stack (most recent call first):
  cmake/Modules/Geant4MacroLibraryTargets.cmake:300 (GEANT4_LIBRARY_TARGET)
  source/processes/CMakeLists.txt:36 (GEANT4_GLOBAL_LIBRARY_TARGET)

CMake Error at cmake/Modules/Geant4MacroLibraryTargets.cmake:111 (target_compile_features):
  The compiler feature "cxx_alias_templates" is not known to CXX compiler

  "GNU"

  version 4.4.7.
Call Stack (most recent call first):
  cmake/Modules/Geant4MacroLibraryTargets.cmake:300 (GEANT4_LIBRARY_TARGET)
  source/readout/CMakeLists.txt:18 (GEANT4_GLOBAL_LIBRARY_TARGET)

CMake Error at cmake/Modules/Geant4MacroLibraryTargets.cmake:111 (target_compile_features):
  The compiler feature "cxx_alias_templates" is not known to CXX compiler

  "GNU"

  version 4.4.7.
Call Stack (most recent call first):
  cmake/Modules/Geant4MacroLibraryTargets.cmake:300 (GEANT4_LIBRARY_TARGET)
  source/run/CMakeLists.txt:21 (GEANT4_GLOBAL_LIBRARY_TARGET)

CMake Error at cmake/Modules/Geant4MacroLibraryTargets.cmake:111 (target_compile_features):
  The compiler feature "cxx_alias_templates" is not known to CXX compiler

  "GNU"

  version 4.4.7.
Call Stack (most recent call first):
  cmake/Modules/Geant4MacroLibraryTargets.cmake:300 (GEANT4_LIBRARY_TARGET)
  source/track/CMakeLists.txt:21 (GEANT4_GLOBAL_LIBRARY_TARGET)

CMake Error at cmake/Modules/Geant4MacroLibraryTargets.cmake:111 (target_compile_features):
  The compiler feature "cxx_alias_templates" is not known to CXX compiler

  "GNU"

  version 4.4.7.
Call Stack (most recent call first):
  cmake/Modules/Geant4MacroLibraryTargets.cmake:300 (GEANT4_LIBRARY_TARGET)
  source/tracking/CMakeLists.txt:21 (GEANT4_GLOBAL_LIBRARY_TARGET)

CMake Error at cmake/Modules/Geant4MacroLibraryTargets.cmake:111 (target_compile_features):
  The compiler feature "cxx_alias_templates" is not known to CXX compiler

  "GNU"

  version 4.4.7.
Call Stack (most recent call first):
  cmake/Modules/Geant4MacroLibraryTargets.cmake:300 (GEANT4_LIBRARY_TARGET)
  source/visualization/FukuiRenderer/CMakeLists.txt:18 (GEANT4_GLOBAL_LIBRARY_TARGET)

CMake Error at cmake/Modules/Geant4MacroLibraryTargets.cmake:111 (target_compile_features):
  The compiler feature "cxx_alias_templates" is not known to CXX compiler

  "GNU"

  version 4.4.7.
Call Stack (most recent call first):
  cmake/Modules/Geant4MacroLibraryTargets.cmake:300 (GEANT4_LIBRARY_TARGET)
  source/visualization/HepRep/CMakeLists.txt:18 (GEANT4_GLOBAL_LIBRARY_TARGET)

CMake Error at cmake/Modules/Geant4MacroLibraryTargets.cmake:111 (target_compile_features):
  The compiler feature "cxx_alias_templates" is not known to CXX compiler

  "GNU"

  version 4.4.7.
Call Stack (most recent call first):
  cmake/Modules/Geant4MacroLibraryTargets.cmake:300 (GEANT4_LIBRARY_TARGET)
  source/visualization/RayTracer/CMakeLists.txt:25 (GEANT4_GLOBAL_LIBRARY_TARGET)

CMake Error at cmake/Modules/Geant4MacroLibraryTargets.cmake:111 (target_compile_features):
  The compiler feature "cxx_alias_templates" is not known to CXX compiler

  "GNU"

  version 4.4.7.
Call Stack (most recent call first):
  cmake/Modules/Geant4MacroLibraryTargets.cmake:300 (GEANT4_LIBRARY_TARGET)
  source/visualization/Tree/CMakeLists.txt:18 (GEANT4_GLOBAL_LIBRARY_TARGET)

CMake Error at cmake/Modules/Geant4MacroLibraryTargets.cmake:111 (target_compile_features):
  The compiler feature "cxx_alias_templates" is not known to CXX compiler

  "GNU"

  version 4.4.7.
Call Stack (most recent call first):
  cmake/Modules/Geant4MacroLibraryTargets.cmake:300 (GEANT4_LIBRARY_TARGET)
  source/visualization/VRML/CMakeLists.txt:18 (GEANT4_GLOBAL_LIBRARY_TARGET)

CMake Error at cmake/Modules/Geant4MacroLibraryTargets.cmake:111 (target_compile_features):
  The compiler feature "cxx_alias_templates" is not known to CXX compiler

  "GNU"

  version 4.4.7.
Call Stack (most recent call first):
  cmake/Modules/Geant4MacroLibraryTargets.cmake:300 (GEANT4_LIBRARY_TARGET)
  source/visualization/XXX/CMakeLists.txt:18 (GEANT4_GLOBAL_LIBRARY_TARGET)

CMake Error at cmake/Modules/Geant4MacroLibraryTargets.cmake:111 (target_compile_features):
  The compiler feature "cxx_alias_templates" is not known to CXX compiler

  "GNU"

  version 4.4.7.
Call Stack (most recent call first):
  cmake/Modules/Geant4MacroLibraryTargets.cmake:300 (GEANT4_LIBRARY_TARGET)
  source/visualization/externals/gl2ps/CMakeLists.txt:18 (GEANT4_GLOBAL_LIBRARY_TARGET)

CMake Error at cmake/Modules/Geant4MacroLibraryTargets.cmake:111 (target_compile_features):
  The compiler feature "cxx_alias_templates" is not known to CXX compiler

  "GNU"

  version 4.4.7.
Call Stack (most recent call first):
  cmake/Modules/Geant4MacroLibraryTargets.cmake:300 (GEANT4_LIBRARY_TARGET)
  source/visualization/gMocren/CMakeLists.txt:18 (GEANT4_GLOBAL_LIBRARY_TARGET)

CMake Error at cmake/Modules/Geant4MacroLibraryTargets.cmake:111 (target_compile_features):
  The compiler feature "cxx_alias_templates" is not known to CXX compiler

  "GNU"

  version 4.4.7.
Call Stack (most recent call first):
  cmake/Modules/Geant4MacroLibraryTargets.cmake:300 (GEANT4_LIBRARY_TARGET)
  source/visualization/management/CMakeLists.txt:18 (GEANT4_GLOBAL_LIBRARY_TARGET)

CMake Error at cmake/Modules/Geant4MacroLibraryTargets.cmake:111 (target_compile_features):
  The compiler feature "cxx_alias_templates" is not known to CXX compiler

  "GNU"

  version 4.4.7.
Call Stack (most recent call first):
  cmake/Modules/Geant4MacroLibraryTargets.cmake:300 (GEANT4_LIBRARY_TARGET)
  source/visualization/modeling/CMakeLists.txt:18 (GEANT4_GLOBAL_LIBRARY_TARGET)

CMake Error at cmake/Modules/Geant4MacroLibraryTargets.cmake:111 (target_compile_features):
  The compiler feature "cxx_alias_templates" is not known to CXX compiler

  "GNU"

  version 4.4.7.
Call Stack (most recent call first):
  cmake/Modules/Geant4MacroLibraryTargets.cmake:300 (GEANT4_LIBRARY_TARGET)
  source/visualization/OpenGL/CMakeLists.txt:18 (GEANT4_GLOBAL_LIBRARY_TARGET)

-- Pre-configuring dataset G4NDL (4.5)
-- Pre-configuring dataset G4EMLOW (6.48)
-- Pre-configuring dataset PhotonEvaporation (3.2)
-- Pre-configuring dataset RadioactiveDecay (4.3)
-- Pre-configuring dataset G4NEUTRONXS (1.4)
-- Pre-configuring dataset G4PII (1.3)
-- Pre-configuring dataset RealSurface (1.0)
-- Pre-configuring dataset G4SAIDDATA (1.1)
-- Pre-configuring dataset G4ABLA (3.0)
-- Pre-configuring dataset G4ENSDFSTATE (1.2)
  *WARNING*
    Geant4 has been pre-configured to look for datasets
    in the directory:

    /home/local1/Geant4/share/Geant4-10.2.0/data

    but the following datasets are NOT present on disk at
    that location:

    G4NDL (4.5)
    G4EMLOW (6.48)
    PhotonEvaporation (3.2)
    RadioactiveDecay (4.3)
    G4NEUTRONXS (1.4)
    G4PII (1.3)
    RealSurface (1.0)
    G4SAIDDATA (1.1)
    G4ABLA (3.0)
    G4ENSDFSTATE (1.2)

    If you want to have these datasets installed automatically
    simply re-run cmake and set the GEANT4_INSTALL_DATA
    variable to ON. This will configure the build to download
    and install these datasets for you. For example, on the
    command line, do:

    cmake -DGEANT4_INSTALL_DATA=ON <otherargs>

    The variable can also be toggled in ccmake or cmake-gui.
    If you're running on a Windows system, this is the best
    solution as CMake will unpack the datasets for you
    without any further software being required

    Alternatively, you can install these datasets manually
    now or after you have installed Geant4. To do this,
    download the following files:

    http://geant4.cern.ch/support/source/G4NDL.4.5.tar.gz
    http://geant4.cern.ch/support/source/G4EMLOW.6.48.tar.gz
    http://geant4.cern.ch/support/source/G4PhotonEvaporation.3.2.tar.gz
    http://geant4.cern.ch/support/source/G4RadioactiveDecay.4.3.tar.gz
    http://geant4.cern.ch/support/source/G4NEUTRONXS.1.4.tar.gz
    http://geant4.cern.ch/support/source/G4PII.1.3.tar.gz
    http://geant4.cern.ch/support/source/RealSurface.1.0.tar.gz
    http://geant4.cern.ch/support/source/G4SAIDDATA.1.1.tar.gz
    http://geant4.cern.ch/support/source/G4ABLA.3.0.tar.gz
    http://geant4.cern.ch/support/source/G4ENSDFSTATE.1.2.tar.gz

    and unpack them under the directory:

    /home/local1/Geant4/share/Geant4-10.2.0/data

    As we supply the datasets packed in gzipped tar files,
    you will need the 'tar' utility to unpack them.

    Nota bene: Missing datasets will not affect or break
               compilation and installation of the Geant4
               libraries.

-- The following Geant4 features are enabled: GEANT4_BUILD_CXXSTD: Compiling against C++ Standard '11' GEANT4_BUILD_TLS_MODEL: Building with TLS model 'initial-exec' GEANT4_BUILD_MULTITHREADED: Build multithread enabled libraries GEANT4_USE_SYSTEM_EXPAT: Using system EXPAT library GEANT4_USE_QT: Build Geant4 with Qt support GEANT4_USE_OPENGL_X11: Build Geant4 OpenGL driver with X11 support

-- Configuring incomplete, errors occurred! See also "/home/local1/geant4.10.02-build/CMakeFiles/CMakeOutput.log". See also "/home/local1/geant4.10.02-build/CMakeFiles/CMakeError.log". localhost.localdomain:/geant4.10.02-build < 6 >

and CMakeOutput.log is :

The system is: Linux - 2.6.32-504.1.3.el6.x86_64 - x86_64 Compiling the C compiler identification source file "CMakeCCompilerId.c" succeeded. Compiler: /usr/bin/cc Build flags: Id flags:

The output was: 0

Compilation of the C compiler identification source "CMakeCCompilerId.c" produced "a.out"

The C compiler identification is GNU, found in "/home/local1/geant4.10.02-build/CMakeFiles/3.4.1/CompilerIdC/a.out"

Compiling the CXX compiler identification source file "CMakeCXXCompilerId.cpp" succeeded. Compiler: /usr/bin/c++ Build flags: Id flags:

The output was: 0

Compilation of the CXX compiler identification source "CMakeCXXCompilerId.cpp" produced "a.out"

The CXX compiler identification is GNU, found in "/home/local1/geant4.10.02-build/CMakeFiles/3.4.1/CompilerIdCXX/a.out"

Determining if the C compiler works passed with the following output: Change Dir: /home/local1/geant4.10.02-build/CMakeFiles/CMakeTmp

Run Build Command:"/usr/bin/gmake" "cmTC_87773/fast" /usr/bin/gmake -f CMakeFiles/cmTC_87773.dir/build.make CMakeFiles/cmTC_87773.dir/build gmake[1]: Entering directory `/home/local1/geant4.10.02-build/CMakeFiles/CMakeTmp' Building C object CMakeFiles/cmTC_87773.dir/testCCompiler.c.o /usr/bin/cc -o CMakeFiles/cmTC_87773.dir/testCCompiler.c.o -c /home/local1/geant4.10.02-build/CMakeFiles/CMakeTmp/testCCompiler.c Linking C executable cmTC_87773 /usr/local/bin/cmake -E cmake_link_script CMakeFiles/cmTC_87773.dir/link.txt --verbose=1 /usr/bin/cc CMakeFiles/cmTC_87773.dir/testCCompiler.c.o -o cmTC_87773 -rdynamic gmake[1]: Leaving directory `/home/local1/geant4.10.02-build/CMakeFiles/CMakeTmp'

Detecting C compiler ABI info compiled with the following output: Change Dir: /home/local1/geant4.10.02-build/CMakeFiles/CMakeTmp

Run Build Command:"/usr/bin/gmake" "cmTC_843ab/fast"
/usr/bin/gmake -f CMakeFiles/cmTC_843ab.dir/build.make CMakeFiles/cmTC_843ab.dir/build
gmake[1]: Entering directory `/home/local1/geant4.10.02-build/CMakeFiles/CMakeTmp'
Building C object CMakeFiles/cmTC_843ab.dir/CMakeCCompilerABI.c.o
/usr/bin/cc     -o CMakeFiles/cmTC_843ab.dir/CMakeCCompilerABI.c.o   -c /usr/local/share/cmake-3.4/Modules/CMakeCCompilerABI.c
Linking C executable cmTC_843ab
/usr/local/bin/cmake -E cmake_link_script CMakeFiles/cmTC_843ab.dir/link.txt --verbose=1
/usr/bin/cc      -v CMakeFiles/cmTC_843ab.dir/CMakeCCompilerABI.c.o  -o cmTC_843ab -rdynamic  
Using built-in specs.
Target: x86_64-redhat-linux
Configured with: ../configure --prefix=/usr --mandir=/usr/share/man --infodir=/usr/share/info --with-bugurl=http://bugzilla.redhat.com/bugzilla --enable-bootstrap --enable-shared --enable-threads=posix --enable-checking=release --with-system-zlib --enable-__cxa_atexit --disable-libunwind-exceptions --enable-gnu-unique-object --enable-languages=c,c++,objc,obj-c++,java,fortran,ada --enable-java-awt=gtk --disable-dssi --with-java-home=/usr/lib/jvm/java-1.5.0-gcj-1.5.0.0/jre --enable-libgcj-multifile --enable-java-maintainer-mode --with-ecj-jar=/usr/share/java/eclipse-ecj.jar --disable-libjava-multilib --with-ppl --with-cloog --with-tune=generic --with-arch_32=i686 --build=x86_64-redhat-linux
Thread model: posix
gcc version 4.4.7 20120313 (Red Hat 4.4.7-16) (GCC) 
COMPILER_PATH=/usr/libexec/gcc/x86_64-redhat-linux/4.4.7/:/usr/libexec/gcc/x86_64-redhat-linux/4.4.7/:/usr/libexec/gcc/x86_64-redhat-linux/:/usr/lib/gcc/x86_64-redhat-linux/4.4.7/:/usr/lib/gcc/x86_64-redhat-linux/:/usr/libexec/gcc/x86_64-redhat-linux/4.4.7/:/usr/libexec/gcc/x86_64-redhat-linux/:/usr/lib/gcc/x86_64-redhat-linux/4.4.7/:/usr/lib/gcc/x86_64-redhat-linux/
LIBRARY_PATH=/usr/lib/gcc/x86_64-redhat-linux/4.4.7/:/usr/lib/gcc/x86_64-redhat-linux/4.4.7/:/usr/lib/gcc/x86_64-redhat-linux/4.4.7/../../../../lib64/:/lib/../lib64/:/usr/lib/../lib64/:/usr/lib/gcc/x86_64-redhat-linux/4.4.7/../../../:/lib/:/usr/lib/
COLLECT_GCC_OPTIONS='-v' '-o' 'cmTC_843ab' '-rdynamic' '-mtune=generic'
 /usr/libexec/gcc/x86_64-redhat-linux/4.4.7/collect2 --eh-frame-hdr --build-id -m elf_x86_64 --hash-style=gnu -export-dynamic -dynamic-linker /lib64/ld-linux-x86-64.so.2 -o cmTC_843ab /usr/lib/gcc/x86_64-redhat-linux/4.4.7/../../../../lib64/crt1.o /usr/lib/gcc/x86_64-redhat-linux/4.4.7/../../../../lib64/crti.o /usr/lib/gcc/x86_64-redhat-linux/4.4.7/crtbegin.o -L/usr/lib/gcc/x86_64-redhat-linux/4.4.7 -L/usr/lib/gcc/x86_64-redhat-linux/4.4.7 -L/usr/lib/gcc/x86_64-redhat-linux/4.4.7/../../../../lib64 -L/lib/../lib64 -L/usr/lib/../lib64 -L/usr/lib/gcc/x86_64-redhat-linux/4.4.7/../../.. CMakeFiles/cmTC_843ab.dir/CMakeCCompilerABI.c.o -lgcc --as-needed -lgcc_s --no-as-needed -lc -lgcc --as-needed -lgcc_s --no-as-needed /usr/lib/gcc/x86_64-redhat-linux/4.4.7/crtend.o /usr/lib/gcc/x86_64-redhat-linux/4.4.7/../../../../lib64/crtn.o
gmake[1]: Leaving directory `/home/local1/geant4.10.02-build/CMakeFiles/CMakeTmp'

Parsed C implicit link information from above output:
  link line regex: [^( *|.*[/\])(ld|([^/\]+-)?ld|collect2)[^/\]*( |$)]
  ignore line: [Change Dir: /home/local1/geant4.10.02-build/CMakeFiles/CMakeTmp]
  ignore line: []
  ignore line: [Run Build Command:"/usr/bin/gmake" "cmTC_843ab/fast"]
  ignore line: [/usr/bin/gmake -f CMakeFiles/cmTC_843ab.dir/build.make CMakeFiles/cmTC_843ab.dir/build]
  ignore line: [gmake[1]: Entering directory `/home/local1/geant4.10.02-build/CMakeFiles/CMakeTmp']
  ignore line: [Building C object CMakeFiles/cmTC_843ab.dir/CMakeCCompilerABI.c.o]
  ignore line: [/usr/bin/cc     -o CMakeFiles/cmTC_843ab.dir/CMakeCCompilerABI.c.o   -c /usr/local/share/cmake-3.4/Modules/CMakeCCompilerABI.c]
  ignore line: [Linking C executable cmTC_843ab]
  ignore line: [/usr/local/bin/cmake -E cmake_link_script CMakeFiles/cmTC_843ab.dir/link.txt --verbose=1]
  ignore line: [/usr/bin/cc      -v CMakeFiles/cmTC_843ab.dir/CMakeCCompilerABI.c.o  -o cmTC_843ab -rdynamic  ]
  ignore line: [Using built-in specs.]
  ignore line: [Target: x86_64-redhat-linux]
  ignore line: [Configured with: ../configure --prefix=/usr --mandir=/usr/share/man --infodir=/usr/share/info --with-bugurl=http://bugzilla.redhat.com/bugzilla --enable-bootstrap --enable-shared --enable-threads=posix --enable-checking=release --with-system-zlib --enable-__cxa_atexit --disable-libunwind-exceptions --enable-gnu-unique-object --enable-languages=c,c++,objc,obj-c++,java,fortran,ada --enable-java-awt=gtk --disable-dssi --with-java-home=/usr/lib/jvm/java-1.5.0-gcj-1.5.0.0/jre --enable-libgcj-multifile --enable-java-maintainer-mode --with-ecj-jar=/usr/share/java/eclipse-ecj.jar --disable-libjava-multilib --with-ppl --with-cloog --with-tune=generic --with-arch_32=i686 --build=x86_64-redhat-linux]
  ignore line: [Thread model: posix]
  ignore line: [gcc version 4.4.7 20120313 (Red Hat 4.4.7-16) (GCC) ]
  ignore line: [COMPILER_PATH=/usr/libexec/gcc/x86_64-redhat-linux/4.4.7/:/usr/libexec/gcc/x86_64-redhat-linux/4.4.7/:/usr/libexec/gcc/x86_64-redhat-linux/:/usr/lib/gcc/x86_64-redhat-linux/4.4.7/:/usr/lib/gcc/x86_64-redhat-linux/:/usr/libexec/gcc/x86_64-redhat-linux/4.4.7/:/usr/libexec/gcc/x86_64-redhat-linux/:/usr/lib/gcc/x86_64-redhat-linux/4.4.7/:/usr/lib/gcc/x86_64-redhat-linux/]
  ignore line: [LIBRARY_PATH=/usr/lib/gcc/x86_64-redhat-linux/4.4.7/:/usr/lib/gcc/x86_64-redhat-linux/4.4.7/:/usr/lib/gcc/x86_64-redhat-linux/4.4.7/../../../../lib64/:/lib/../lib64/:/usr/lib/../lib64/:/usr/lib/gcc/x86_64-redhat-linux/4.4.7/../../../:/lib/:/usr/lib/]
  ignore line: [COLLECT_GCC_OPTIONS='-v' '-o' 'cmTC_843ab' '-rdynamic' '-mtune=generic']
  link line: [ /usr/libexec/gcc/x86_64-redhat-linux/4.4.7/collect2 --eh-frame-hdr --build-id -m elf_x86_64 --hash-style=gnu -export-dynamic -dynamic-linker /lib64/ld-linux-x86-64.so.2 -o cmTC_843ab /usr/lib/gcc/x86_64-redhat-linux/4.4.7/../../../../lib64/crt1.o /usr/lib/gcc/x86_64-redhat-linux/4.4.7/../../../../lib64/crti.o /usr/lib/gcc/x86_64-redhat-linux/4.4.7/crtbegin.o -L/usr/lib/gcc/x86_64-redhat-linux/4.4.7 -L/usr/lib/gcc/x86_64-redhat-linux/4.4.7 -L/usr/lib/gcc/x86_64-redhat-linux/4.4.7/../../../../lib64 -L/lib/../lib64 -L/usr/lib/../lib64 -L/usr/lib/gcc/x86_64-redhat-linux/4.4.7/../../.. CMakeFiles/cmTC_843ab.dir/CMakeCCompilerABI.c.o -lgcc --as-needed -lgcc_s --no-as-needed -lc -lgcc --as-needed -lgcc_s --no-as-needed /usr/lib/gcc/x86_64-redhat-linux/4.4.7/crtend.o /usr/lib/gcc/x86_64-redhat-linux/4.4.7/../../../../lib64/crtn.o]
    arg [/usr/libexec/gcc/x86_64-redhat-linux/4.4.7/collect2] ==> ignore
    arg [--eh-frame-hdr] ==> ignore
    arg [--build-id] ==> ignore
    arg [-m] ==> ignore
    arg [elf_x86_64] ==> ignore
    arg [--hash-style=gnu] ==> ignore
    arg [-export-dynamic] ==> ignore
    arg [-dynamic-linker] ==> ignore
    arg [/lib64/ld-linux-x86-64.so.2] ==> ignore
    arg [-o] ==> ignore
    arg [cmTC_843ab] ==> ignore
    arg [/usr/lib/gcc/x86_64-redhat-linux/4.4.7/../../../../lib64/crt1.o] ==> ignore
    arg [/usr/lib/gcc/x86_64-redhat-linux/4.4.7/../../../../lib64/crti.o] ==> ignore
    arg [/usr/lib/gcc/x86_64-redhat-linux/4.4.7/crtbegin.o] ==> ignore
    arg [-L/usr/lib/gcc/x86_64-redhat-linux/4.4.7] ==> dir [/usr/lib/gcc/x86_64-redhat-linux/4.4.7]
    arg [-L/usr/lib/gcc/x86_64-redhat-linux/4.4.7] ==> dir [/usr/lib/gcc/x86_64-redhat-linux/4.4.7]
    arg [-L/usr/lib/gcc/x86_64-redhat-linux/4.4.7/../../../../lib64] ==> dir [/usr/lib/gcc/x86_64-redhat-linux/4.4.7/../../../../lib64]
    arg [-L/lib/../lib64] ==> dir [/lib/../lib64]
    arg [-L/usr/lib/../lib64] ==> dir [/usr/lib/../lib64]
    arg [-L/usr/lib/gcc/x86_64-redhat-linux/4.4.7/../../..] ==> dir [/usr/lib/gcc/x86_64-redhat-linux/4.4.7/../../..]
    arg [CMakeFiles/cmTC_843ab.dir/CMakeCCompilerABI.c.o] ==> ignore
    arg [-lgcc] ==> lib [gcc]
    arg [--as-needed] ==> ignore
    arg [-lgcc_s] ==> lib [gcc_s]
    arg [--no-as-needed] ==> ignore
    arg [-lc] ==> lib [c]
    arg [-lgcc] ==> lib [gcc]
    arg [--as-needed] ==> ignore
    arg [-lgcc_s] ==> lib [gcc_s]
    arg [--no-as-needed] ==> ignore
    arg [/usr/lib/gcc/x86_64-redhat-linux/4.4.7/crtend.o] ==> ignore
    arg [/usr/lib/gcc/x86_64-redhat-linux/4.4.7/../../../../lib64/crtn.o] ==> ignore
  remove lib [gcc]
  remove lib [gcc_s]
  remove lib [gcc]
  remove lib [gcc_s]
  collapse library dir [/usr/lib/gcc/x86_64-redhat-linux/4.4.7] ==> [/usr/lib/gcc/x86_64-redhat-linux/4.4.7]
  collapse library dir [/usr/lib/gcc/x86_64-redhat-linux/4.4.7] ==> [/usr/lib/gcc/x86_64-redhat-linux/4.4.7]
  collapse library dir [/usr/lib/gcc/x86_64-redhat-linux/4.4.7/../../../../lib64] ==> [/usr/lib64]
  collapse library dir [/lib/../lib64] ==> [/lib64]
  collapse library dir [/usr/lib/../lib64] ==> [/usr/lib64]
  collapse library dir [/usr/lib/gcc/x86_64-redhat-linux/4.4.7/../../..] ==> [/usr/lib]
  implicit libs: [c]
  implicit dirs: [/usr/lib/gcc/x86_64-redhat-linux/4.4.7;/usr/lib64;/lib64;/usr/lib]
  implicit fwks: []

Detecting C [-std=c99] compiler features compiled with the following output: Change Dir: /home/local1/geant4.10.02-build/CMakeFiles/CMakeTmp

Run Build Command:"/usr/bin/gmake" "cmTC_28755/fast" /usr/bin/gmake -f CMakeFiles/cmTC_28755.dir/build.make CMakeFiles/cmTC_28755.dir/build gmake[1]: Entering directory `/home/local1/geant4.10.02-build/CMakeFiles/CMakeTmp' Building C object CMakeFiles/cmTC_28755.dir/feature_tests.c.o /usr/bin/cc -std=c99 -o CMakeFiles/cmTC_28755.dir/feature_tests.c.o -c /home/local1/geant4.10.02-build/CMakeFiles/feature_tests.c Linking C executable cmTC_28755 /usr/local/bin/cmake -E cmake_link_script CMakeFiles/cmTC_28755.dir/link.txt --verbose=1 /usr/bin/cc CMakeFiles/cmTC_28755.dir/feature_tests.c.o -o cmTC_28755 -rdynamic gmake[1]: Leaving directory `/home/local1/geant4.10.02-build/CMakeFiles/CMakeTmp'

    Feature record: C_FEATURE:1c_function_prototypes
    Feature record: C_FEATURE:1c_restrict
    Feature record: C_FEATURE:0c_static_assert
    Feature record: C_FEATURE:1c_variadic_macros

Detecting C [-std=c89] compiler features compiled with the following output: Change Dir: /home/local1/geant4.10.02-build/CMakeFiles/CMakeTmp

Run Build Command:"/usr/bin/gmake" "cmTC_cb4f8/fast" /usr/bin/gmake -f CMakeFiles/cmTC_cb4f8.dir/build.make CMakeFiles/cmTC_cb4f8.dir/build gmake[1]: Entering directory `/home/local1/geant4.10.02-build/CMakeFiles/CMakeTmp' Building C object CMakeFiles/cmTC_cb4f8.dir/feature_tests.c.o /usr/bin/cc -std=c89 -o CMakeFiles/cmTC_cb4f8.dir/feature_tests.c.o -c /home/local1/geant4.10.02-build/CMakeFiles/feature_tests.c Linking C executable cmTC_cb4f8 /usr/local/bin/cmake -E cmake_link_script CMakeFiles/cmTC_cb4f8.dir/link.txt --verbose=1 /usr/bin/cc CMakeFiles/cmTC_cb4f8.dir/feature_tests.c.o -o cmTC_cb4f8 -rdynamic gmake[1]: Leaving directory `/home/local1/geant4.10.02-build/CMakeFiles/CMakeTmp'

    Feature record: C_FEATURE:1c_function_prototypes
    Feature record: C_FEATURE:0c_restrict
    Feature record: C_FEATURE:0c_static_assert
    Feature record: C_FEATURE:0c_variadic_macros
Determining if the CXX compiler works passed with the following output:
Change Dir: /home/local1/geant4.10.02-build/CMakeFiles/CMakeTmp

Run Build Command:"/usr/bin/gmake" "cmTC_1de34/fast" /usr/bin/gmake -f CMakeFiles/cmTC_1de34.dir/build.make CMakeFiles/cmTC_1de34.dir/build gmake[1]: Entering directory `/home/local1/geant4.10.02-build/CMakeFiles/CMakeTmp' Building CXX object CMakeFiles/cmTC_1de34.dir/testCXXCompiler.cxx.o /usr/bin/c++ -W -Wall -pedantic -Wno-non-virtual-dtor -Wno-long-long -Wwrite-strings -Wpointer-arith -Woverloaded-virtual -Wno-variadic-macros -Wshadow -pipe -o CMakeFiles/cmTC_1de34.dir/testCXXCompiler.cxx.o -c /home/local1/geant4.10.02-build/CMakeFiles/CMakeTmp/testCXXCompiler.cxx Linking CXX executable cmTC_1de34 /usr/local/bin/cmake -E cmake_link_script CMakeFiles/cmTC_1de34.dir/link.txt --verbose=1 /usr/bin/c++ -W -Wall -pedantic -Wno-non-virtual-dtor -Wno-long-long -Wwrite-strings -Wpointer-arith -Woverloaded-virtual -Wno-variadic-macros -Wshadow -pipe CMakeFiles/cmTC_1de34.dir/testCXXCompiler.cxx.o -o cmTC_1de34 -rdynamic gmake[1]: Leaving directory `/home/local1/geant4.10.02-build/CMakeFiles/CMakeTmp'

Detecting CXX compiler ABI info compiled with the following output: Change Dir: /home/local1/geant4.10.02-build/CMakeFiles/CMakeTmp

Run Build Command:"/usr/bin/gmake" "cmTC_2ba31/fast"
/usr/bin/gmake -f CMakeFiles/cmTC_2ba31.dir/build.make CMakeFiles/cmTC_2ba31.dir/build
gmake[1]: Entering directory `/home/local1/geant4.10.02-build/CMakeFiles/CMakeTmp'
Building CXX object CMakeFiles/cmTC_2ba31.dir/CMakeCXXCompilerABI.cpp.o
/usr/bin/c++     -W -Wall -pedantic -Wno-non-virtual-dtor -Wno-long-long -Wwrite-strings -Wpointer-arith -Woverloaded-virtual -Wno-variadic-macros -Wshadow -pipe    -o CMakeFiles/cmTC_2ba31.dir/CMakeCXXCompilerABI.cpp.o -c /usr/local/share/cmake-3.4/Modules/CMakeCXXCompilerABI.cpp
Linking CXX executable cmTC_2ba31
/usr/local/bin/cmake -E cmake_link_script CMakeFiles/cmTC_2ba31.dir/link.txt --verbose=1
/usr/bin/c++    -W -Wall -pedantic -Wno-non-virtual-dtor -Wno-long-long -Wwrite-strings -Wpointer-arith -Woverloaded-virtual -Wno-variadic-macros -Wshadow -pipe    -v CMakeFiles/cmTC_2ba31.dir/CMakeCXXCompilerABI.cpp.o  -o cmTC_2ba31 -rdynamic  
Using built-in specs.
Target: x86_64-redhat-linux
Configured with: ../configure --prefix=/usr --mandir=/usr/share/man --infodir=/usr/share/info --with-bugurl=http://bugzilla.redhat.com/bugzilla --enable-bootstrap --enable-shared --enable-threads=posix --enable-checking=release --with-system-zlib --enable-__cxa_atexit --disable-libunwind-exceptions --enable-gnu-unique-object --enable-languages=c,c++,objc,obj-c++,java,fortran,ada --enable-java-awt=gtk --disable-dssi --with-java-home=/usr/lib/jvm/java-1.5.0-gcj-1.5.0.0/jre --enable-libgcj-multifile --enable-java-maintainer-mode --with-ecj-jar=/usr/share/java/eclipse-ecj.jar --disable-libjava-multilib --with-ppl --with-cloog --with-tune=generic --with-arch_32=i686 --build=x86_64-redhat-linux
Thread model: posix
gcc version 4.4.7 20120313 (Red Hat 4.4.7-16) (GCC) 
COMPILER_PATH=/usr/libexec/gcc/x86_64-redhat-linux/4.4.7/:/usr/libexec/gcc/x86_64-redhat-linux/4.4.7/:/usr/libexec/gcc/x86_64-redhat-linux/:/usr/lib/gcc/x86_64-redhat-linux/4.4.7/:/usr/lib/gcc/x86_64-redhat-linux/:/usr/libexec/gcc/x86_64-redhat-linux/4.4.7/:/usr/libexec/gcc/x86_64-redhat-linux/:/usr/lib/gcc/x86_64-redhat-linux/4.4.7/:/usr/lib/gcc/x86_64-redhat-linux/
LIBRARY_PATH=/usr/lib/gcc/x86_64-redhat-linux/4.4.7/:/usr/lib/gcc/x86_64-redhat-linux/4.4.7/:/usr/lib/gcc/x86_64-redhat-linux/4.4.7/../../../../lib64/:/lib/../lib64/:/usr/lib/../lib64/:/usr/lib/gcc/x86_64-redhat-linux/4.4.7/../../../:/lib/:/usr/lib/
COLLECT_GCC_OPTIONS='-W' '-Wall' '-pedantic' '-Wno-non-virtual-dtor' '-Wno-long-long' '-Wwrite-strings' '-Wpointer-arith' '-Woverloaded-virtual' '-Wno-variadic-macros' '-Wshadow' '-pipe' '-v' '-o' 'cmTC_2ba31' '-rdynamic' '-shared-libgcc' '-mtune=generic'
 /usr/libexec/gcc/x86_64-redhat-linux/4.4.7/collect2 --eh-frame-hdr --build-id -m elf_x86_64 --hash-style=gnu -export-dynamic -dynamic-linker /lib64/ld-linux-x86-64.so.2 -o cmTC_2ba31 /usr/lib/gcc/x86_64-redhat-linux/4.4.7/../../../../lib64/crt1.o /usr/lib/gcc/x86_64-redhat-linux/4.4.7/../../../../lib64/crti.o /usr/lib/gcc/x86_64-redhat-linux/4.4.7/crtbegin.o -L/usr/lib/gcc/x86_64-redhat-linux/4.4.7 -L/usr/lib/gcc/x86_64-redhat-linux/4.4.7 -L/usr/lib/gcc/x86_64-redhat-linux/4.4.7/../../../../lib64 -L/lib/../lib64 -L/usr/lib/../lib64 -L/usr/lib/gcc/x86_64-redhat-linux/4.4.7/../../.. CMakeFiles/cmTC_2ba31.dir/CMakeCXXCompilerABI.cpp.o -lstdc++ -lm -lgcc_s -lgcc -lc -lgcc_s -lgcc /usr/lib/gcc/x86_64-redhat-linux/4.4.7/crtend.o /usr/lib/gcc/x86_64-redhat-linux/4.4.7/../../../../lib64/crtn.o
gmake[1]: Leaving directory `/home/local1/geant4.10.02-build/CMakeFiles/CMakeTmp'

Parsed CXX implicit link information from above output:
  link line regex: [^( *|.*[/\])(ld|([^/\]+-)?ld|collect2)[^/\]*( |$)]
  ignore line: [Change Dir: /home/local1/geant4.10.02-build/CMakeFiles/CMakeTmp]
  ignore line: []
  ignore line: [Run Build Command:"/usr/bin/gmake" "cmTC_2ba31/fast"]
  ignore line: [/usr/bin/gmake -f CMakeFiles/cmTC_2ba31.dir/build.make CMakeFiles/cmTC_2ba31.dir/build]
  ignore line: [gmake[1]: Entering directory `/home/local1/geant4.10.02-build/CMakeFiles/CMakeTmp']
  ignore line: [Building CXX object CMakeFiles/cmTC_2ba31.dir/CMakeCXXCompilerABI.cpp.o]
  ignore line: [/usr/bin/c++     -W -Wall -pedantic -Wno-non-virtual-dtor -Wno-long-long -Wwrite-strings -Wpointer-arith -Woverloaded-virtual -Wno-variadic-macros -Wshadow -pipe    -o CMakeFiles/cmTC_2ba31.dir/CMakeCXXCompilerABI.cpp.o -c /usr/local/share/cmake-3.4/Modules/CMakeCXXCompilerABI.cpp]
  ignore line: [Linking CXX executable cmTC_2ba31]
  ignore line: [/usr/local/bin/cmake -E cmake_link_script CMakeFiles/cmTC_2ba31.dir/link.txt --verbose=1]
  ignore line: [/usr/bin/c++    -W -Wall -pedantic -Wno-non-virtual-dtor -Wno-long-long -Wwrite-strings -Wpointer-arith -Woverloaded-virtual -Wno-variadic-macros -Wshadow -pipe    -v CMakeFiles/cmTC_2ba31.dir/CMakeCXXCompilerABI.cpp.o  -o cmTC_2ba31 -rdynamic  ]
  ignore line: [Using built-in specs.]
  ignore line: [Target: x86_64-redhat-linux]
  ignore line: [Configured with: ../configure --prefix=/usr --mandir=/usr/share/man --infodir=/usr/share/info --with-bugurl=http://bugzilla.redhat.com/bugzilla --enable-bootstrap --enable-shared --enable-threads=posix --enable-checking=release --with-system-zlib --enable-__cxa_atexit --disable-libunwind-exceptions --enable-gnu-unique-object --enable-languages=c,c++,objc,obj-c++,java,fortran,ada --enable-java-awt=gtk --disable-dssi --with-java-home=/usr/lib/jvm/java-1.5.0-gcj-1.5.0.0/jre --enable-libgcj-multifile --enable-java-maintainer-mode --with-ecj-jar=/usr/share/java/eclipse-ecj.jar --disable-libjava-multilib --with-ppl --with-cloog --with-tune=generic --with-arch_32=i686 --build=x86_64-redhat-linux]
  ignore line: [Thread model: posix]
  ignore line: [gcc version 4.4.7 20120313 (Red Hat 4.4.7-16) (GCC) ]
  ignore line: [COMPILER_PATH=/usr/libexec/gcc/x86_64-redhat-linux/4.4.7/:/usr/libexec/gcc/x86_64-redhat-linux/4.4.7/:/usr/libexec/gcc/x86_64-redhat-linux/:/usr/lib/gcc/x86_64-redhat-linux/4.4.7/:/usr/lib/gcc/x86_64-redhat-linux/:/usr/libexec/gcc/x86_64-redhat-linux/4.4.7/:/usr/libexec/gcc/x86_64-redhat-linux/:/usr/lib/gcc/x86_64-redhat-linux/4.4.7/:/usr/lib/gcc/x86_64-redhat-linux/]
  ignore line: [LIBRARY_PATH=/usr/lib/gcc/x86_64-redhat-linux/4.4.7/:/usr/lib/gcc/x86_64-redhat-linux/4.4.7/:/usr/lib/gcc/x86_64-redhat-linux/4.4.7/../../../../lib64/:/lib/../lib64/:/usr/lib/../lib64/:/usr/lib/gcc/x86_64-redhat-linux/4.4.7/../../../:/lib/:/usr/lib/]
  ignore line: [COLLECT_GCC_OPTIONS='-W' '-Wall' '-pedantic' '-Wno-non-virtual-dtor' '-Wno-long-long' '-Wwrite-strings' '-Wpointer-arith' '-Woverloaded-virtual' '-Wno-variadic-macros' '-Wshadow' '-pipe' '-v' '-o' 'cmTC_2ba31' '-rdynamic' '-shared-libgcc' '-mtune=generic']
  link line: [ /usr/libexec/gcc/x86_64-redhat-linux/4.4.7/collect2 --eh-frame-hdr --build-id -m elf_x86_64 --hash-style=gnu -export-dynamic -dynamic-linker /lib64/ld-linux-x86-64.so.2 -o cmTC_2ba31 /usr/lib/gcc/x86_64-redhat-linux/4.4.7/../../../../lib64/crt1.o /usr/lib/gcc/x86_64-redhat-linux/4.4.7/../../../../lib64/crti.o /usr/lib/gcc/x86_64-redhat-linux/4.4.7/crtbegin.o -L/usr/lib/gcc/x86_64-redhat-linux/4.4.7 -L/usr/lib/gcc/x86_64-redhat-linux/4.4.7 -L/usr/lib/gcc/x86_64-redhat-linux/4.4.7/../../../../lib64 -L/lib/../lib64 -L/usr/lib/../lib64 -L/usr/lib/gcc/x86_64-redhat-linux/4.4.7/../../.. CMakeFiles/cmTC_2ba31.dir/CMakeCXXCompilerABI.cpp.o -lstdc++ -lm -lgcc_s -lgcc -lc -lgcc_s -lgcc /usr/lib/gcc/x86_64-redhat-linux/4.4.7/crtend.o /usr/lib/gcc/x86_64-redhat-linux/4.4.7/../../../../lib64/crtn.o]
    arg [/usr/libexec/gcc/x86_64-redhat-linux/4.4.7/collect2] ==> ignore
    arg [--eh-frame-hdr] ==> ignore
    arg [--build-id] ==> ignore
    arg [-m] ==> ignore
    arg [elf_x86_64] ==> ignore
    arg [--hash-style=gnu] ==> ignore
    arg [-export-dynamic] ==> ignore
    arg [-dynamic-linker] ==> ignore
    arg [/lib64/ld-linux-x86-64.so.2] ==> ignore
    arg [-o] ==> ignore
    arg [cmTC_2ba31] ==> ignore
    arg [/usr/lib/gcc/x86_64-redhat-linux/4.4.7/../../../../lib64/crt1.o] ==> ignore
    arg [/usr/lib/gcc/x86_64-redhat-linux/4.4.7/../../../../lib64/crti.o] ==> ignore
    arg [/usr/lib/gcc/x86_64-redhat-linux/4.4.7/crtbegin.o] ==> ignore
    arg [-L/usr/lib/gcc/x86_64-redhat-linux/4.4.7] ==> dir [/usr/lib/gcc/x86_64-redhat-linux/4.4.7]
    arg [-L/usr/lib/gcc/x86_64-redhat-linux/4.4.7] ==> dir [/usr/lib/gcc/x86_64-redhat-linux/4.4.7]
    arg [-L/usr/lib/gcc/x86_64-redhat-linux/4.4.7/../../../../lib64] ==> dir [/usr/lib/gcc/x86_64-redhat-linux/4.4.7/../../../../lib64]
    arg [-L/lib/../lib64] ==> dir [/lib/../lib64]
    arg [-L/usr/lib/../lib64] ==> dir [/usr/lib/../lib64]
    arg [-L/usr/lib/gcc/x86_64-redhat-linux/4.4.7/../../..] ==> dir [/usr/lib/gcc/x86_64-redhat-linux/4.4.7/../../..]
    arg [CMakeFiles/cmTC_2ba31.dir/CMakeCXXCompilerABI.cpp.o] ==> ignore
    arg [-lstdc++] ==> lib [stdc++]
    arg [-lm] ==> lib [m]
    arg [-lgcc_s] ==> lib [gcc_s]
    arg [-lgcc] ==> lib [gcc]
    arg [-lc] ==> lib [c]
    arg [-lgcc_s] ==> lib [gcc_s]
    arg [-lgcc] ==> lib [gcc]
    arg [/usr/lib/gcc/x86_64-redhat-linux/4.4.7/crtend.o] ==> ignore
    arg [/usr/lib/gcc/x86_64-redhat-linux/4.4.7/../../../../lib64/crtn.o] ==> ignore
  remove lib [gcc_s]
  remove lib [gcc]
  remove lib [gcc_s]
  remove lib [gcc]
  collapse library dir [/usr/lib/gcc/x86_64-redhat-linux/4.4.7] ==> [/usr/lib/gcc/x86_64-redhat-linux/4.4.7]
  collapse library dir [/usr/lib/gcc/x86_64-redhat-linux/4.4.7] ==> [/usr/lib/gcc/x86_64-redhat-linux/4.4.7]
  collapse library dir [/usr/lib/gcc/x86_64-redhat-linux/4.4.7/../../../../lib64] ==> [/usr/lib64]
  collapse library dir [/lib/../lib64] ==> [/lib64]
  collapse library dir [/usr/lib/../lib64] ==> [/usr/lib64]
  collapse library dir [/usr/lib/gcc/x86_64-redhat-linux/4.4.7/../../..] ==> [/usr/lib]
  implicit libs: [stdc++;m;c]
  implicit dirs: [/usr/lib/gcc/x86_64-redhat-linux/4.4.7;/usr/lib64;/lib64;/usr/lib]
  implicit fwks: []

Detecting CXX [-std=c++0x] compiler features compiled with the following output: Change Dir: /home/local1/geant4.10.02-build/CMakeFiles/CMakeTmp

Run Build Command:"/usr/bin/gmake" "cmTC_43fe8/fast" /usr/bin/gmake -f CMakeFiles/cmTC_43fe8.dir/build.make CMakeFiles/cmTC_43fe8.dir/build gmake[1]: Entering directory `/home/local1/geant4.10.02-build/CMakeFiles/CMakeTmp' Building CXX object CMakeFiles/cmTC_43fe8.dir/feature_tests.cxx.o /usr/bin/c++ -W -Wall -pedantic -Wno-non-virtual-dtor -Wno-long-long -Wwrite-strings -Wpointer-arith -Woverloaded-virtual -Wno-variadic-macros -Wshadow -pipe -std=c++0x -o CMakeFiles/cmTC_43fe8.dir/feature_tests.cxx.o -c /home/local1/geant4.10.02-build/CMakeFiles/feature_tests.cxx Linking CXX executable cmTC_43fe8 /usr/local/bin/cmake -E cmake_link_script CMakeFiles/cmTC_43fe8.dir/link.txt --verbose=1 /usr/bin/c++ -W -Wall -pedantic -Wno-non-virtual-dtor -Wno-long-long -Wwrite-strings -Wpointer-arith -Woverloaded-virtual -Wno-variadic-macros -Wshadow -pipe CMakeFiles/cmTC_43fe8.dir/feature_tests.cxx.o -o cmTC_43fe8 -rdynamic gmake[1]: Leaving directory `/home/local1/geant4.10.02-build/CMakeFiles/CMakeTmp'

    Feature record: CXX_FEATURE:0cxx_aggregate_default_initializers
    Feature record: CXX_FEATURE:0cxx_alias_templates
    Feature record: CXX_FEATURE:0cxx_alignas
    Feature record: CXX_FEATURE:0cxx_alignof
    Feature record: CXX_FEATURE:0cxx_attributes
    Feature record: CXX_FEATURE:0cxx_attribute_deprecated
    Feature record: CXX_FEATURE:1cxx_auto_type
    Feature record: CXX_FEATURE:0cxx_binary_literals
    Feature record: CXX_FEATURE:0cxx_constexpr
    Feature record: CXX_FEATURE:0cxx_contextual_conversions
    Feature record: CXX_FEATURE:1cxx_decltype
    Feature record: CXX_FEATURE:0cxx_decltype_auto
    Feature record: CXX_FEATURE:0cxx_decltype_incomplete_return_types
    Feature record: CXX_FEATURE:1cxx_default_function_template_args
    Feature record: CXX_FEATURE:1cxx_defaulted_functions
    Feature record: CXX_FEATURE:0cxx_defaulted_move_initializers
    Feature record: CXX_FEATURE:0cxx_delegating_constructors
    Feature record: CXX_FEATURE:1cxx_deleted_functions
    Feature record: CXX_FEATURE:0cxx_digit_separators
    Feature record: CXX_FEATURE:0cxx_enum_forward_declarations
    Feature record: CXX_FEATURE:0cxx_explicit_conversions
    Feature record: CXX_FEATURE:0cxx_extended_friend_declarations
    Feature record: CXX_FEATURE:1cxx_extern_templates
    Feature record: CXX_FEATURE:0cxx_final
    Feature record: CXX_FEATURE:1cxx_func_identifier
    Feature record: CXX_FEATURE:1cxx_generalized_initializers
    Feature record: CXX_FEATURE:0cxx_generic_lambdas
    Feature record: CXX_FEATURE:0cxx_inheriting_constructors
    Feature record: CXX_FEATURE:1cxx_inline_namespaces
    Feature record: CXX_FEATURE:0cxx_lambdas
    Feature record: CXX_FEATURE:0cxx_lambda_init_captures
    Feature record: CXX_FEATURE:0cxx_local_type_template_args
    Feature record: CXX_FEATURE:1cxx_long_long_type
    Feature record: CXX_FEATURE:0cxx_noexcept
    Feature record: CXX_FEATURE:0cxx_nonstatic_member_init
    Feature record: CXX_FEATURE:0cxx_nullptr
    Feature record: CXX_FEATURE:0cxx_override
    Feature record: CXX_FEATURE:0cxx_range_for
    Feature record: CXX_FEATURE:0cxx_raw_string_literals
    Feature record: CXX_FEATURE:0cxx_reference_qualified_functions
    Feature record: CXX_FEATURE:0cxx_relaxed_constexpr
    Feature record: CXX_FEATURE:0cxx_return_type_deduction
    Feature record: CXX_FEATURE:1cxx_right_angle_brackets
    Feature record: CXX_FEATURE:1cxx_rvalue_references
    Feature record: CXX_FEATURE:1cxx_sizeof_member
    Feature record: CXX_FEATURE:1cxx_static_assert
    Feature record: CXX_FEATURE:1cxx_strong_enums
    Feature record: CXX_FEATURE:1cxx_template_template_parameters
    Feature record: CXX_FEATURE:0cxx_thread_local
    Feature record: CXX_FEATURE:1cxx_trailing_return_types
    Feature record: CXX_FEATURE:1cxx_unicode_literals
    Feature record: CXX_FEATURE:1cxx_uniform_initialization
    Feature record: CXX_FEATURE:0cxx_unrestricted_unions
    Feature record: CXX_FEATURE:0cxx_user_literals
    Feature record: CXX_FEATURE:0cxx_variable_templates
    Feature record: CXX_FEATURE:1cxx_variadic_macros
    Feature record: CXX_FEATURE:1cxx_variadic_templates

Detecting CXX [-std=c++98] compiler features compiled with the following output: Change Dir: /home/local1/geant4.10.02-build/CMakeFiles/CMakeTmp

Run Build Command:"/usr/bin/gmake" "cmTC_089f5/fast" /usr/bin/gmake -f CMakeFiles/cmTC_089f5.dir/build.make CMakeFiles/cmTC_089f5.dir/build gmake[1]: Entering directory `/home/local1/geant4.10.02-build/CMakeFiles/CMakeTmp' Building CXX object CMakeFiles/cmTC_089f5.dir/feature_tests.cxx.o /usr/bin/c++ -W -Wall -pedantic -Wno-non-virtual-dtor -Wno-long-long -Wwrite-strings -Wpointer-arith -Woverloaded-virtual -Wno-variadic-macros -Wshadow -pipe -std=c++98 -o CMakeFiles/cmTC_089f5.dir/feature_tests.cxx.o -c /home/local1/geant4.10.02-build/CMakeFiles/feature_tests.cxx Linking CXX executable cmTC_089f5 /usr/local/bin/cmake -E cmake_link_script CMakeFiles/cmTC_089f5.dir/link.txt --verbose=1 /usr/bin/c++ -W -Wall -pedantic -Wno-non-virtual-dtor -Wno-long-long -Wwrite-strings -Wpointer-arith -Woverloaded-virtual -Wno-variadic-macros -Wshadow -pipe CMakeFiles/cmTC_089f5.dir/feature_tests.cxx.o -o cmTC_089f5 -rdynamic gmake[1]: Leaving directory `/home/local1/geant4.10.02-build/CMakeFiles/CMakeTmp'

    Feature record: CXX_FEATURE:0cxx_aggregate_default_initializers
    Feature record: CXX_FEATURE:0cxx_alias_templates
    Feature record: CXX_FEATURE:0cxx_alignas
    Feature record: CXX_FEATURE:0cxx_alignof
    Feature record: CXX_FEATURE:0cxx_attributes
    Feature record: CXX_FEATURE:0cxx_attribute_deprecated
    Feature record: CXX_FEATURE:0cxx_auto_type
    Feature record: CXX_FEATURE:0cxx_binary_literals
    Feature record: CXX_FEATURE:0cxx_constexpr
    Feature record: CXX_FEATURE:0cxx_contextual_conversions
    Feature record: CXX_FEATURE:0cxx_decltype
    Feature record: CXX_FEATURE:0cxx_decltype_auto
    Feature record: CXX_FEATURE:0cxx_decltype_incomplete_return_types
    Feature record: CXX_FEATURE:0cxx_default_function_template_args
    Feature record: CXX_FEATURE:0cxx_defaulted_functions
    Feature record: CXX_FEATURE:0cxx_defaulted_move_initializers
    Feature record: CXX_FEATURE:0cxx_delegating_constructors
    Feature record: CXX_FEATURE:0cxx_deleted_functions
    Feature record: CXX_FEATURE:0cxx_digit_separators
    Feature record: CXX_FEATURE:0cxx_enum_forward_declarations
    Feature record: CXX_FEATURE:0cxx_explicit_conversions
    Feature record: CXX_FEATURE:0cxx_extended_friend_declarations
    Feature record: CXX_FEATURE:0cxx_extern_templates
    Feature record: CXX_FEATURE:0cxx_final
    Feature record: CXX_FEATURE:0cxx_func_identifier
    Feature record: CXX_FEATURE:0cxx_generalized_initializers
    Feature record: CXX_FEATURE:0cxx_generic_lambdas
    Feature record: CXX_FEATURE:0cxx_inheriting_constructors
    Feature record: CXX_FEATURE:0cxx_inline_namespaces
    Feature record: CXX_FEATURE:0cxx_lambdas
    Feature record: CXX_FEATURE:0cxx_lambda_init_captures
    Feature record: CXX_FEATURE:0cxx_local_type_template_args
    Feature record: CXX_FEATURE:0cxx_long_long_type
    Feature record: CXX_FEATURE:0cxx_noexcept
    Feature record: CXX_FEATURE:0cxx_nonstatic_member_init
    Feature record: CXX_FEATURE:0cxx_nullptr
    Feature record: CXX_FEATURE:0cxx_override
    Feature record: CXX_FEATURE:0cxx_range_for
    Feature record: CXX_FEATURE:0cxx_raw_string_literals
    Feature record: CXX_FEATURE:0cxx_reference_qualified_functions
    Feature record: CXX_FEATURE:0cxx_relaxed_constexpr
    Feature record: CXX_FEATURE:0cxx_return_type_deduction
    Feature record: CXX_FEATURE:0cxx_right_angle_brackets
    Feature record: CXX_FEATURE:0cxx_rvalue_references
    Feature record: CXX_FEATURE:0cxx_sizeof_member
    Feature record: CXX_FEATURE:0cxx_static_assert
    Feature record: CXX_FEATURE:0cxx_strong_enums
    Feature record: CXX_FEATURE:1cxx_template_template_parameters
    Feature record: CXX_FEATURE:0cxx_thread_local
    Feature record: CXX_FEATURE:0cxx_trailing_return_types
    Feature record: CXX_FEATURE:0cxx_unicode_literals
    Feature record: CXX_FEATURE:0cxx_uniform_initialization
    Feature record: CXX_FEATURE:0cxx_unrestricted_unions
    Feature record: CXX_FEATURE:0cxx_user_literals
    Feature record: CXX_FEATURE:0cxx_variable_templates
    Feature record: CXX_FEATURE:0cxx_variadic_macros
    Feature record: CXX_FEATURE:0cxx_variadic_templates
Performing C++ SOURCE FILE Test HAVE_TLS succeded with the following output:
Change Dir: /home/local1/geant4.10.02-build/CMakeFiles/CMakeTmp

Run Build Command:"/usr/bin/gmake" "cmTC_bbf4e/fast" /usr/bin/gmake -f CMakeFiles/cmTC_bbf4e.dir/build.make CMakeFiles/cmTC_bbf4e.dir/build gmake[1]: Entering directory `/home/local1/geant4.10.02-build/CMakeFiles/CMakeTmp' Building CXX object CMakeFiles/cmTC_bbf4e.dir/src.cxx.o /usr/bin/c++ -W -Wall -pedantic -Wno-non-virtual-dtor -Wno-long-long -Wwrite-strings -Wpointer-arith -Woverloaded-virtual -Wno-variadic-macros -Wshadow -pipe -DG4USE_STD11 -DHAVE_TLS -o CMakeFiles/cmTC_bbf4e.dir/src.cxx.o -c /home/local1/geant4.10.02-build/CMakeFiles/CMakeTmp/src.cxx Linking CXX executable cmTC_bbf4e /usr/local/bin/cmake -E cmake_link_script CMakeFiles/cmTC_bbf4e.dir/link.txt --verbose=1 /usr/bin/c++ -W -Wall -pedantic -Wno-non-virtual-dtor -Wno-long-long -Wwrite-strings -Wpointer-arith -Woverloaded-virtual -Wno-variadic-macros -Wshadow -pipe -DG4USE_STD11 -DHAVE_TLS CMakeFiles/cmTC_bbf4e.dir/src.cxx.o -o cmTC_bbf4e -rdynamic gmake[1]: Leaving directory `/home/local1/geant4.10.02-build/CMakeFiles/CMakeTmp'

Source file was: __thread int i; int main(){return 0;} Determining if the Q_WS_X11 exist passed with the following output: Change Dir: /home/local1/geant4.10.02-build/CMakeFiles/CMakeTmp

Run Build Command:"/usr/bin/gmake" "cmTC_d7562/fast" /usr/bin/gmake -f CMakeFiles/cmTC_d7562.dir/build.make CMakeFiles/cmTC_d7562.dir/build gmake[1]: Entering directory `/home/local1/geant4.10.02-build/CMakeFiles/CMakeTmp' Building CXX object CMakeFiles/cmTC_d7562.dir/CheckSymbolExists.cxx.o /usr/bin/c++ -I/usr/local/Qt/4.8.6/include -W -Wall -pedantic -Wno-non-virtual-dtor -Wno-long-long -Wwrite-strings -Wpointer-arith -Woverloaded-virtual -Wno-variadic-macros -Wshadow -pipe -DG4USE_STD11 -pthread -ftls-model=initial-exec -o CMakeFiles/cmTC_d7562.dir/CheckSymbolExists.cxx.o -c /home/local1/geant4.10.02-build/CMakeFiles/CMakeTmp/CheckSymbolExists.cxx Linking CXX executable cmTC_d7562 /usr/local/bin/cmake -E cmake_link_script CMakeFiles/cmTC_d7562.dir/link.txt --verbose=1 /usr/bin/c++ -W -Wall -pedantic -Wno-non-virtual-dtor -Wno-long-long -Wwrite-strings -Wpointer-arith -Woverloaded-virtual -Wno-variadic-macros -Wshadow -pipe -DG4USE_STD11 -pthread -ftls-model=initial-exec CMakeFiles/cmTC_d7562.dir/CheckSymbolExists.cxx.o -o cmTC_d7562 -rdynamic gmake[1]: Leaving directory `/home/local1/geant4.10.02-build/CMakeFiles/CMakeTmp'

File /home/local1/geant4.10.02-build/CMakeFiles/CMakeTmp/CheckSymbolExists.cxx: /* */ #include <QtCore/qglobal.h>

int main(int argc, char** argv)
{
  (void)argv;
#ifndef Q_WS_X11
  return ((int*)(&Q_WS_X11))[argc];
#else
  (void)argc;
  return 0;
#endif
}

Determining if the function XOpenDisplay exists in the /usr/lib64/libX11.so;/usr/lib64/libXext.so passed with the following output: Change Dir: /home/local1/geant4.10.02-build/CMakeFiles/CMakeTmp

Run Build Command:"/usr/bin/gmake" "cmTC_32817/fast" /usr/bin/gmake -f CMakeFiles/cmTC_32817.dir/build.make CMakeFiles/cmTC_32817.dir/build gmake[1]: Entering directory `/home/local1/geant4.10.02-build/CMakeFiles/CMakeTmp' Building C object CMakeFiles/cmTC_32817.dir/CheckFunctionExists.c.o /usr/bin/cc -DCHECK_FUNCTION_EXISTS=XOpenDisplay -o CMakeFiles/cmTC_32817.dir/CheckFunctionExists.c.o -c /usr/local/share/cmake-3.4/Modules/CheckFunctionExists.c Linking C executable cmTC_32817 /usr/local/bin/cmake -E cmake_link_script CMakeFiles/cmTC_32817.dir/link.txt --verbose=1 /usr/bin/cc -DCHECK_FUNCTION_EXISTS=XOpenDisplay CMakeFiles/cmTC_32817.dir/CheckFunctionExists.c.o -o cmTC_32817 -rdynamic /usr/lib64/libX11.so /usr/lib64/libXext.so gmake[1]: Leaving directory `/home/local1/geant4.10.02-build/CMakeFiles/CMakeTmp'

Determining if the function gethostbyname exists passed with the following output: Change Dir: /home/local1/geant4.10.02-build/CMakeFiles/CMakeTmp

Run Build Command:"/usr/bin/gmake" "cmTC_ca90b/fast" /usr/bin/gmake -f CMakeFiles/cmTC_ca90b.dir/build.make CMakeFiles/cmTC_ca90b.dir/build gmake[1]: Entering directory `/home/local1/geant4.10.02-build/CMakeFiles/CMakeTmp' Building C object CMakeFiles/cmTC_ca90b.dir/CheckFunctionExists.c.o /usr/bin/cc -DCHECK_FUNCTION_EXISTS=gethostbyname -o CMakeFiles/cmTC_ca90b.dir/CheckFunctionExists.c.o -c /usr/local/share/cmake-3.4/Modules/CheckFunctionExists.c Linking C executable cmTC_ca90b /usr/local/bin/cmake -E cmake_link_script CMakeFiles/cmTC_ca90b.dir/link.txt --verbose=1 /usr/bin/cc -DCHECK_FUNCTION_EXISTS=gethostbyname CMakeFiles/cmTC_ca90b.dir/CheckFunctionExists.c.o -o cmTC_ca90b -rdynamic gmake[1]: Leaving directory `/home/local1/geant4.10.02-build/CMakeFiles/CMakeTmp'

Determining if the function connect exists passed with the following output: Change Dir: /home/local1/geant4.10.02-build/CMakeFiles/CMakeTmp

Run Build Command:"/usr/bin/gmake" "cmTC_27c10/fast" /usr/bin/gmake -f CMakeFiles/cmTC_27c10.dir/build.make CMakeFiles/cmTC_27c10.dir/build gmake[1]: Entering directory `/home/local1/geant4.10.02-build/CMakeFiles/CMakeTmp' Building C object CMakeFiles/cmTC_27c10.dir/CheckFunctionExists.c.o /usr/bin/cc -DCHECK_FUNCTION_EXISTS=connect -o CMakeFiles/cmTC_27c10.dir/CheckFunctionExists.c.o -c /usr/local/share/cmake-3.4/Modules/CheckFunctionExists.c Linking C executable cmTC_27c10 /usr/local/bin/cmake -E cmake_link_script CMakeFiles/cmTC_27c10.dir/link.txt --verbose=1 /usr/bin/cc -DCHECK_FUNCTION_EXISTS=connect CMakeFiles/cmTC_27c10.dir/CheckFunctionExists.c.o -o cmTC_27c10 -rdynamic gmake[1]: Leaving directory `/home/local1/geant4.10.02-build/CMakeFiles/CMakeTmp'

Determining if the function remove exists passed with the following output: Change Dir: /home/local1/geant4.10.02-build/CMakeFiles/CMakeTmp

Run Build Command:"/usr/bin/gmake" "cmTC_df036/fast" /usr/bin/gmake -f CMakeFiles/cmTC_df036.dir/build.make CMakeFiles/cmTC_df036.dir/build gmake[1]: Entering directory `/home/local1/geant4.10.02-build/CMakeFiles/CMakeTmp' Building C object CMakeFiles/cmTC_df036.dir/CheckFunctionExists.c.o /usr/bin/cc -DCHECK_FUNCTION_EXISTS=remove -o CMakeFiles/cmTC_df036.dir/CheckFunctionExists.c.o -c /usr/local/share/cmake-3.4/Modules/CheckFunctionExists.c Linking C executable cmTC_df036 /usr/local/bin/cmake -E cmake_link_script CMakeFiles/cmTC_df036.dir/link.txt --verbose=1 /usr/bin/cc -DCHECK_FUNCTION_EXISTS=remove CMakeFiles/cmTC_df036.dir/CheckFunctionExists.c.o -o cmTC_df036 -rdynamic gmake[1]: Leaving directory `/home/local1/geant4.10.02-build/CMakeFiles/CMakeTmp'

Determining if the function shmat exists passed with the following output: Change Dir: /home/local1/geant4.10.02-build/CMakeFiles/CMakeTmp

Run Build Command:"/usr/bin/gmake" "cmTC_43c89/fast" /usr/bin/gmake -f CMakeFiles/cmTC_43c89.dir/build.make CMakeFiles/cmTC_43c89.dir/build gmake[1]: Entering directory `/home/local1/geant4.10.02-build/CMakeFiles/CMakeTmp' Building C object CMakeFiles/cmTC_43c89.dir/CheckFunctionExists.c.o /usr/bin/cc -DCHECK_FUNCTION_EXISTS=shmat -o CMakeFiles/cmTC_43c89.dir/CheckFunctionExists.c.o -c /usr/local/share/cmake-3.4/Modules/CheckFunctionExists.c Linking C executable cmTC_43c89 /usr/local/bin/cmake -E cmake_link_script CMakeFiles/cmTC_43c89.dir/link.txt --verbose=1 /usr/bin/cc -DCHECK_FUNCTION_EXISTS=shmat CMakeFiles/cmTC_43c89.dir/CheckFunctionExists.c.o -o cmTC_43c89 -rdynamic gmake[1]: Leaving directory `/home/local1/geant4.10.02-build/CMakeFiles/CMakeTmp'

Determining if the function IceConnectionNumber exists in the ICE passed with the following output: Change Dir: /home/local1/geant4.10.02-build/CMakeFiles/CMakeTmp

Run Build Command:"/usr/bin/gmake" "cmTC_d6fd5/fast" /usr/bin/gmake -f CMakeFiles/cmTC_d6fd5.dir/build.make CMakeFiles/cmTC_d6fd5.dir/build gmake[1]: Entering directory `/home/local1/geant4.10.02-build/CMakeFiles/CMakeTmp' Building C object CMakeFiles/cmTC_d6fd5.dir/CheckFunctionExists.c.o /usr/bin/cc -DCHECK_FUNCTION_EXISTS=IceConnectionNumber -o CMakeFiles/cmTC_d6fd5.dir/CheckFunctionExists.c.o -c /usr/local/share/cmake-3.4/Modules/CheckFunctionExists.c Linking C executable cmTC_d6fd5 /usr/local/bin/cmake -E cmake_link_script CMakeFiles/cmTC_d6fd5.dir/link.txt --verbose=1 /usr/bin/cc -DCHECK_FUNCTION_EXISTS=IceConnectionNumber CMakeFiles/cmTC_d6fd5.dir/CheckFunctionExists.c.o -o cmTC_d6fd5 -rdynamic -lICE gmake[1]: Leaving directory `/home/local1/geant4.10.02-build/CMakeFiles/CMakeTmp'

Determining if the include file sys/types.h exists passed with the following output: Change Dir: /home/local1/geant4.10.02-build/CMakeFiles/CMakeTmp

Run Build Command:"/usr/bin/gmake" "cmTC_00894/fast" /usr/bin/gmake -f CMakeFiles/cmTC_00894.dir/build.make CMakeFiles/cmTC_00894.dir/build gmake[1]: Entering directory `/home/local1/geant4.10.02-build/CMakeFiles/CMakeTmp' Building C object CMakeFiles/cmTC_00894.dir/CheckIncludeFile.c.o /usr/bin/cc -o CMakeFiles/cmTC_00894.dir/CheckIncludeFile.c.o -c /home/local1/geant4.10.02-build/CMakeFiles/CMakeTmp/CheckIncludeFile.c Linking C executable cmTC_00894 /usr/local/bin/cmake -E cmake_link_script CMakeFiles/cmTC_00894.dir/link.txt --verbose=1 /usr/bin/cc CMakeFiles/cmTC_00894.dir/CheckIncludeFile.c.o -o cmTC_00894 -rdynamic gmake[1]: Leaving directory `/home/local1/geant4.10.02-build/CMakeFiles/CMakeTmp'

Determining if the include file stdint.h exists passed with the following output: Change Dir: /home/local1/geant4.10.02-build/CMakeFiles/CMakeTmp

Run Build Command:"/usr/bin/gmake" "cmTC_cb48f/fast" /usr/bin/gmake -f CMakeFiles/cmTC_cb48f.dir/build.make CMakeFiles/cmTC_cb48f.dir/build gmake[1]: Entering directory `/home/local1/geant4.10.02-build/CMakeFiles/CMakeTmp' Building C object CMakeFiles/cmTC_cb48f.dir/CheckIncludeFile.c.o /usr/bin/cc -o CMakeFiles/cmTC_cb48f.dir/CheckIncludeFile.c.o -c /home/local1/geant4.10.02-build/CMakeFiles/CMakeTmp/CheckIncludeFile.c Linking C executable cmTC_cb48f /usr/local/bin/cmake -E cmake_link_script CMakeFiles/cmTC_cb48f.dir/link.txt --verbose=1 /usr/bin/cc CMakeFiles/cmTC_cb48f.dir/CheckIncludeFile.c.o -o cmTC_cb48f -rdynamic gmake[1]: Leaving directory `/home/local1/geant4.10.02-build/CMakeFiles/CMakeTmp'

Determining if the include file stddef.h exists passed with the following output: Change Dir: /home/local1/geant4.10.02-build/CMakeFiles/CMakeTmp

Run Build Command:"/usr/bin/gmake" "cmTC_ecdcf/fast" /usr/bin/gmake -f CMakeFiles/cmTC_ecdcf.dir/build.make CMakeFiles/cmTC_ecdcf.dir/build gmake[1]: Entering directory `/home/local1/geant4.10.02-build/CMakeFiles/CMakeTmp' Building C object CMakeFiles/cmTC_ecdcf.dir/CheckIncludeFile.c.o /usr/bin/cc -o CMakeFiles/cmTC_ecdcf.dir/CheckIncludeFile.c.o -c /home/local1/geant4.10.02-build/CMakeFiles/CMakeTmp/CheckIncludeFile.c Linking C executable cmTC_ecdcf /usr/local/bin/cmake -E cmake_link_script CMakeFiles/cmTC_ecdcf.dir/link.txt --verbose=1 /usr/bin/cc CMakeFiles/cmTC_ecdcf.dir/CheckIncludeFile.c.o -o cmTC_ecdcf -rdynamic gmake[1]: Leaving directory `/home/local1/geant4.10.02-build/CMakeFiles/CMakeTmp'

Determining size of off64_t passed with the following output: Change Dir: /home/local1/geant4.10.02-build/CMakeFiles/CMakeTmp

Run Build Command:"/usr/bin/gmake" "cmTC_f38c6/fast" /usr/bin/gmake -f CMakeFiles/cmTC_f38c6.dir/build.make CMakeFiles/cmTC_f38c6.dir/build gmake[1]: Entering directory `/home/local1/geant4.10.02-build/CMakeFiles/CMakeTmp' Building C object CMakeFiles/cmTC_f38c6.dir/OFF64_T.c.o /usr/bin/cc -DHAVE_STDDEF_H -DHAVE_STDINT_H -DHAVE_SYS_TYPES_H -D_LARGEFILE64_SOURCE=1 -o CMakeFiles/cmTC_f38c6.dir/OFF64_T.c.o -c /home/local1/geant4.10.02-build/CMakeFiles/CheckTypeSize/OFF64_T.c Linking C executable cmTC_f38c6 /usr/local/bin/cmake -E cmake_link_script CMakeFiles/cmTC_f38c6.dir/link.txt --verbose=1 /usr/bin/cc CMakeFiles/cmTC_f38c6.dir/OFF64_T.c.o -o cmTC_f38c6 -rdynamic gmake[1]: Leaving directory `/home/local1/geant4.10.02-build/CMakeFiles/CMakeTmp'

Determining if the function fseeko exists passed with the following output: Change Dir: /home/local1/geant4.10.02-build/CMakeFiles/CMakeTmp

Run Build Command:"/usr/bin/gmake" "cmTC_8a346/fast" /usr/bin/gmake -f CMakeFiles/cmTC_8a346.dir/build.make CMakeFiles/cmTC_8a346.dir/build gmake[1]: Entering directory `/home/local1/geant4.10.02-build/CMakeFiles/CMakeTmp' Building C object CMakeFiles/cmTC_8a346.dir/CheckFunctionExists.c.o /usr/bin/cc -DCHECK_FUNCTION_EXISTS=fseeko -o CMakeFiles/cmTC_8a346.dir/CheckFunctionExists.c.o -c /usr/local/share/cmake-3.4/Modules/CheckFunctionExists.c Linking C executable cmTC_8a346 /usr/local/bin/cmake -E cmake_link_script CMakeFiles/cmTC_8a346.dir/link.txt --verbose=1 /usr/bin/cc -DCHECK_FUNCTION_EXISTS=fseeko CMakeFiles/cmTC_8a346.dir/CheckFunctionExists.c.o -o cmTC_8a346 -rdynamic gmake[1]: Leaving directory `/home/local1/geant4.10.02-build/CMakeFiles/CMakeTmp'

Determining if the include file unistd.h exists passed with the following output: Change Dir: /home/local1/geant4.10.02-build/CMakeFiles/CMakeTmp

Run Build Command:"/usr/bin/gmake" "cmTC_6bdbf/fast" /usr/bin/gmake -f CMakeFiles/cmTC_6bdbf.dir/build.make CMakeFiles/cmTC_6bdbf.dir/build gmake[1]: Entering directory `/home/local1/geant4.10.02-build/CMakeFiles/CMakeTmp' Building C object CMakeFiles/cmTC_6bdbf.dir/CheckIncludeFile.c.o /usr/bin/cc -o CMakeFiles/cmTC_6bdbf.dir/CheckIncludeFile.c.o -c /home/local1/geant4.10.02-build/CMakeFiles/CMakeTmp/CheckIncludeFile.c Linking C executable cmTC_6bdbf /usr/local/bin/cmake -E cmake_link_script CMakeFiles/cmTC_6bdbf.dir/link.txt --verbose=1 /usr/bin/cc CMakeFiles/cmTC_6bdbf.dir/CheckIncludeFile.c.o -o cmTC_6bdbf -rdynamic gmake[1]: Leaving directory `/home/local1/geant4.10.02-build/CMakeFiles/CMakeTmp'

and CMake Error.log is:

Determining if the Q_WS_WIN exist failed with the following output: Change Dir: /home/local1/geant4.10.02-build/CMakeFiles/CMakeTmp

Run Build Command:"/usr/bin/gmake" "cmTC_f2379/fast" /usr/bin/gmake -f CMakeFiles/cmTC_f2379.dir/build.make CMakeFiles/cmTC_f2379.dir/build gmake[1]: Entering directory `/home/local1/geant4.10.02-build/CMakeFiles/CMakeTmp' Building CXX object CMakeFiles/cmTC_f2379.dir/CheckSymbolExists.cxx.o /usr/bin/c++ -I/usr/local/Qt/4.8.6/include -W -Wall -pedantic -Wno-non-virtual-dtor -Wno-long-long -Wwrite-strings -Wpointer-arith -Woverloaded-virtual -Wno-variadic-macros -Wshadow -pipe -DG4USE_STD11 -pthread -ftls-model=initial-exec -o CMakeFiles/cmTC_f2379.dir/CheckSymbolExists.cxx.o -c /home/local1/geant4.10.02-build/CMakeFiles/CMakeTmp/CheckSymbolExists.cxx /home/local1/geant4.10.02-build/CMakeFiles/CMakeTmp/CheckSymbolExists.cxx: In function int main(int, char**): /home/local1/geant4.10.02-build/CMakeFiles/CMakeTmp/CheckSymbolExists.cxx:8: error: Q_WS_WIN was not declared in this scope gmake[1]: Leaving directory `/home/local1/geant4.10.02-build/CMakeFiles/CMakeTmp' gmake[1]: *** [CMakeFiles/cmTC_f2379.dir/CheckSymbolExists.cxx.o] Error 1 gmake: *** [cmTC_f2379/fast] Error 2

File /home/local1/geant4.10.02-build/CMakeFiles/CMakeTmp/CheckSymbolExists.cxx: /* */ #include <QtCore/qglobal.h>

int main(int argc, char** argv)
{
  (void)argv;
#ifndef Q_WS_WIN
  return ((int*)(&Q_WS_WIN))[argc];
#else
  (void)argc;
  return 0;
#endif
}

Determining if the Q_WS_QWS exist failed with the following output: Change Dir: /home/local1/geant4.10.02-build/CMakeFiles/CMakeTmp

Run Build Command:"/usr/bin/gmake" "cmTC_7c4b9/fast" /usr/bin/gmake -f CMakeFiles/cmTC_7c4b9.dir/build.make CMakeFiles/cmTC_7c4b9.dir/build gmake[1]: Entering directory `/home/local1/geant4.10.02-build/CMakeFiles/CMakeTmp' Building CXX object CMakeFiles/cmTC_7c4b9.dir/CheckSymbolExists.cxx.o /usr/bin/c++ -I/usr/local/Qt/4.8.6/include -W -Wall -pedantic -Wno-non-virtual-dtor -Wno-long-long -Wwrite-strings -Wpointer-arith -Woverloaded-virtual -Wno-variadic-macros -Wshadow -pipe -DG4USE_STD11 -pthread -ftls-model=initial-exec -o CMakeFiles/cmTC_7c4b9.dir/CheckSymbolExists.cxx.o -c /home/local1/geant4.10.02-build/CMakeFiles/CMakeTmp/CheckSymbolExists.cxx /home/local1/geant4.10.02-build/CMakeFiles/CMakeTmp/CheckSymbolExists.cxx: In function int main(int, char**): /home/local1/geant4.10.02-build/CMakeFiles/CMakeTmp/CheckSymbolExists.cxx:8: error: Q_WS_QWS was not declared in this scope gmake[1]: Leaving directory `/home/local1/geant4.10.02-build/CMakeFiles/CMakeTmp' gmake[1]: *** [CMakeFiles/cmTC_7c4b9.dir/CheckSymbolExists.cxx.o] Error 1 gmake: *** [cmTC_7c4b9/fast] Error 2

File /home/local1/geant4.10.02-build/CMakeFiles/CMakeTmp/CheckSymbolExists.cxx: /* */ #include <QtCore/qglobal.h>

int main(int argc, char** argv)
{
  (void)argv;
#ifndef Q_WS_QWS
  return ((int*)(&Q_WS_QWS))[argc];
#else
  (void)argc;
  return 0;
#endif
}

Determining if the Q_WS_MAC exist failed with the following output: Change Dir: /home/local1/geant4.10.02-build/CMakeFiles/CMakeTmp

Run Build Command:"/usr/bin/gmake" "cmTC_6c6b5/fast" /usr/bin/gmake -f CMakeFiles/cmTC_6c6b5.dir/build.make CMakeFiles/cmTC_6c6b5.dir/build gmake[1]: Entering directory `/home/local1/geant4.10.02-build/CMakeFiles/CMakeTmp' Building CXX object CMakeFiles/cmTC_6c6b5.dir/CheckSymbolExists.cxx.o /usr/bin/c++ -I/usr/local/Qt/4.8.6/include -W -Wall -pedantic -Wno-non-virtual-dtor -Wno-long-long -Wwrite-strings -Wpointer-arith -Woverloaded-virtual -Wno-variadic-macros -Wshadow -pipe -DG4USE_STD11 -pthread -ftls-model=initial-exec -o CMakeFiles/cmTC_6c6b5.dir/CheckSymbolExists.cxx.o -c /home/local1/geant4.10.02-build/CMakeFiles/CMakeTmp/CheckSymbolExists.cxx /home/local1/geant4.10.02-build/CMakeFiles/CMakeTmp/CheckSymbolExists.cxx: In function int main(int, char**): /home/local1/geant4.10.02-build/CMakeFiles/CMakeTmp/CheckSymbolExists.cxx:8: error: Q_WS_MAC was not declared in this scope gmake[1]: *** [CMakeFiles/cmTC_6c6b5.dir/CheckSymbolExists.cxx.o] Error 1 gmake[1]: Leaving directory `/home/local1/geant4.10.02-build/CMakeFiles/CMakeTmp' gmake: *** [cmTC_6c6b5/fast] Error 2

File /home/local1/geant4.10.02-build/CMakeFiles/CMakeTmp/CheckSymbolExists.cxx: /* */ #include <QtCore/qglobal.h>

int main(int argc, char** argv)
{
  (void)argv;
#ifndef Q_WS_MAC
  return ((int*)(&Q_WS_MAC))[argc];
#else
  (void)argc;
  return 0;
#endif
}

what's the solution ? I have updated CMake , gnu make , ... , but the problem exists. thanks

Inline Depth:
 1 1
 All All
Outline Depth:
 1 1
 2 2
 All All
Add message: (add)

1 None: Re: Error installation geant4.10.02 on scientific linux 6.6   (Artem Zontikov - 19 Dec, 2015)
1 Question: Re: Error installation geant4.10.02 on scientific linux 6.6   (Rassoul Jamshidzehi - 19 Dec, 2015)
2 Question: Re: Error installation geant4.10.02 on scientific linux 6.6   (Malihe - 30 Dec, 2015)
1 None: Re: Error installation geant4.10.02 on scientific linux 6.6   (Rassoul Jamshidzehi - 03 Jan, 2016)
2 Question: Re: Error installation geant4.10.02 on scientific linux 6.6   (Cristian Bungau - 03 Jan, 2016)
1 None: Re: Error installation geant4.10.02 on scientific linux 6.6   (Rassoul Jamshidzehi - 03 Jan, 2016)
 Add Message Add Message
to: "Error installation geant4.10.02 on scientific linux 6.6 "

 Subscribe Subscribe

This site runs SLAC HyperNews version 1.11-slac-98, derived from the original HyperNews


[ Geant 4 Home | Geant 4 HyperNews | Search | Request New Forum | Feedback ]