Message: CMake error: Externals/G4NDL-4.5/src/G4NDL-stamp/download-G4NDL Not Logged In (login)
 Next-in-Thread Next-in-Thread
 Next-in-Forum Next-in-Forum

Question CMake error: Externals/G4NDL-4.5/src/G4NDL-stamp/download-G4NDL 

Forum: Installation and Configuration
Date: 11 Mar, 2015
From: BMW <BMW>

Hi,

For example, when you install geant4.10.01 on ubuntu 14.10 running cmake....

xxxxxx@BMW:~/geant4.10.1-build$ ls

CMakeCache.txt Externals LICENSE.txt CMakeCPackOptions.cmake geant4-config Makefile CMakeFiles Geant4Config.cmake Modules cmake_install.cmake Geant4ConfigVersion.cmake outputs cmake_uninstall.cmake Geant4LibraryDepends.cmake README.txt cmake_uninstall.cmake.in geant4make.csh source CPackConfig.cmake geant4make.sh UseGeant4.cmake CPackSourceConfig.cmake geant4_validate_sources.cmake UseGeant4_internal.cmake data InstallTreeFiles

Then running make install, obtaining

[  0%] Built target G4ABLA
[  0%] Built target G4EMLOW
[  0%] Built target G4ENSDFSTATE
[  0%] Performing download step (download, verify and extract) for 'G4NDL'
-- downloading...
     src='http://geant4.cern.ch/support/source/G4NDL.4.5.tar.gz'
     dst='/home/bmw/geant4.10.1-build/Externals/G4NDL-4.5/src/G4NDL.4.5.tar.gz'
     timeout='1500 seconds'
-- [download 0% complete]
-- [download 1% complete]
-- [download 2% complete]
-- [download 3% complete]
-- [download 4% complete]
-- [download 5% complete]
-- [download 6% complete]
-- [download 7% complete]
-- [download 8% complete]
-- [download 9% complete]
-- [download 10% complete]
-- [download 11% complete]
-- [download 12% complete]
-- [download 13% complete]
-- [download 14% complete]
-- [download 15% complete]
-- [download 16% complete]
-- [download 17% complete]
-- [download 18% complete]
-- [download 19% complete]
-- [download 20% complete]
-- [download 21% complete]
-- [download 22% complete]
-- [download 23% complete]
-- [download 24% complete]
-- [download 25% complete]
-- [download 26% complete]
-- [download 27% complete]
-- [download 28% complete]
-- [download 29% complete]
-- [download 30% complete]
-- [download 31% complete]
-- [download 32% complete]
-- [download 33% complete]
-- [download 34% complete]
-- [download 35% complete]
-- [download 36% complete]
-- [download 37% complete]
-- [download 38% complete]
-- [download 39% complete]
-- [download 40% complete]
-- [download 41% complete]
-- [download 42% complete]
-- [download 43% complete]
-- [download 44% complete]
-- [download 45% complete]
-- [download 46% complete]
-- [download 47% complete]
-- [download 48% complete]
-- [download 49% complete]
-- [download 50% complete]
-- [download 51% complete]
-- [download 52% complete]
-- [download 53% complete]
-- [download 54% complete]
-- [download 55% complete]
-- [download 56% complete]
-- [download 57% complete]
-- [download 58% complete]
-- [download 59% complete]
-- [download 60% complete]
-- [download 61% complete]
-- [download 62% complete]
-- [download 63% complete]
-- [download 64% complete]
-- [download 65% complete]
-- [download 66% complete]
-- [download 67% complete]
-- [download 68% complete]
-- [download 69% complete]
-- [download 70% complete]
-- [download 71% complete]
-- [download 72% complete]
-- [download 73% complete]
-- [download 74% complete]
CMake Error at ~/geant4.10.1-build/Externals/G4NDL-4.5/src/G4NDL-stamp/download-G4NDL.cmake:9 (file):
  file DOWNLOAD HASH mismatch

    for file: [~/geant4.10.1-build/Externals/G4NDL-4.5/src/G4NDL.4.5.tar.gz]
      expected hash: [fd29c45fe2de432f1f67232707b654c0]
        actual hash: [6d9d4520e46f38104587136d2eea3ff4]

CMakeFiles/G4NDL.dir/build.make:82: recipe for target 'Externals/G4NDL-4.5/src/G4NDL-stamp/G4NDL-download' failed make[2]: *** [Externals/G4NDL-4.5/src/G4NDL-stamp/G4NDL-download] Error 1 CMakeFiles/Makefile2:165: recipe for target 'CMakeFiles/G4NDL.dir/all' failed make[1]: *** [CMakeFiles/G4NDL.dir/all] Error 2 Makefile:133: recipe for target 'all' failed make: *** [all] Error 2

Any ideas Thanks Andreas

Inline Depth:
 1 1
 All All
Outline Depth:
 1 1
 2 2
 All All
Add message: (add)

1 None: Re: CMake error: Externals/G4NDL-4.5/src/G4NDL-stamp/download-G4NDL   (Ben Morgan - 18 Mar, 2015)
 Add Message Add Message
to: "CMake error: Externals/G4NDL-4.5/src/G4NDL-stamp/download-G4NDL"

 Subscribe Subscribe

This site runs SLAC HyperNews version 1.11-slac-98, derived from the original HyperNews


[ Geant 4 Home | Geant 4 HyperNews | Search | Request New Forum | Feedback ]