Message: geant4.9.5 re-compillation of $G4INSTALL/source Not Logged In (login)
 Next-in-Thread Next-in-Thread
 Next-in-Forum Next-in-Forum

Question geant4.9.5 re-compillation of $G4INSTALL/source 

Forum: Installation and Configuration
Date: 09 Mar, 2012
From: Cristian Bungau <Cristian Bungau>

Dear all,

In the previous releases of geant4 I used to be able to recompile the libraries. But now this is what I get:

source ~/geant4/geant4.9.5-install/share/Geant4-9.5.0/geant4make/geant4make.sh

cd $G4INSTALL/source

make clean

make

and I get all these errors:

.......................................

Making dependency for file src/G4VWeightWindowStore.cc ...
include/G4VWeightWindowStore.hh:44:22: fatal error: globals.hh: No such file or directory
compilation terminated.
Making dependency for file src/G4VWeightWindowAlgorithm.cc ...
include/G4Nsplit_Weight.hh:43:22: fatal error: globals.hh: No such file or directory
compilation terminated.
Making dependency for file src/G4VIStore.cc ...
include/G4VIStore.hh:47:22: fatal error: globals.hh: No such file or directory
compilation terminated.
Making dependency for file src/G4VImportanceSplitExaminer.cc ...
include/G4VImportanceSplitExaminer.hh:46:22: fatal error: globals.hh: No such file or directory
compilation terminated.
Making dependency for file src/G4VImportanceAlgorithm.cc ...
include/G4Nsplit_Weight.hh:43:22: fatal error: globals.hh: No such file or directory
compilation terminated.
Making dependency for file src/G4VGCellFinder.cc ...
include/G4VGCellFinder.hh:46:22: fatal error: globals.hh: No such file or directory
compilation terminated.
Making dependency for file src/G4Nsplit_Weight.cc ...
include/G4Nsplit_Weight.hh:43:22: fatal error: globals.hh: No such file or directory
compilation terminated.
Making dependency for file src/G4IStore.cc ...
include/G4VIStore.hh:47:22: fatal error: globals.hh: No such file or directory
compilation terminated.
Making dependency for file src/G4ImportanceAlgorithm.cc ...
src/G4ImportanceAlgorithm.cc:37:22: fatal error: G4Types.hh: No such file or directory
compilation terminated.
Making dependency for file src/G4GeometryCellStepStream.cc ...
include/G4GeometryCell.hh:46:22: fatal error: globals.hh: No such file or directory
compilation terminated.
Making dependency for file src/G4GeometryCellStep.cc ...
include/G4GeometryCell.hh:46:22: fatal error: globals.hh: No such file or directory
compilation terminated.
Making dependency for file src/G4GeometryCellImportance.cc ...
include/G4GeometryCellImportance.hh:44:22: fatal error: globals.hh: No such file or directory
compilation terminated.
Making dependency for file src/G4GeometryCellComp.cc ...
include/G4GeometryCellComp.hh:42:22: fatal error: globals.hh: No such file or directory
compilation terminated.
Making dependency for file src/G4GeometryCell.cc ...
include/G4GeometryCell.hh:46:22: fatal error: globals.hh: No such file or directory
compilation terminated.
Compiling G4GeometryCell.cc ...
In file included from src/G4GeometryCell.cc:37:0:
include/G4GeometryCell.hh:46:22: fatal error: globals.hh: No such file or directory
compilation terminated.
make[2]: *** [/home/adriana/geant4_workdir/tmp/Linux-g++/G4geombias/G4GeometryCell.o] Error 1
Making dependency for file src/G4VDivisionParameterisation.cc ...
include/G4VDivisionParameterisation.hh:46:22: fatal error: G4Types.hh: No such file or directory
compilation terminated.
Making dependency for file src/G4ReplicatedSlice.cc ...
include/G4ReplicatedSlice.hh:65:23: fatal error: geomdefs.hh: No such file or directory
compilation terminated.
Making dependency for file src/G4PVDivisionFactory.cc ...
include/G4PVDivisionFactory.hh:43:23: fatal error: geomdefs.hh: No such file or directory
compilation terminated.
Making dependency for file src/G4PVDivision.cc ...
include/G4PVDivision.hh:73:23: fatal error: geomdefs.hh: No such file or directory
compilation terminated.
Making dependency for file src/G4ParameterisationTubs.cc ...
include/G4VDivisionParameterisation.hh:46:22: fatal error: G4Types.hh: No such file or directory
compilation terminated.
Making dependency for file src/G4ParameterisationTrd.cc ...
include/G4VDivisionParameterisation.hh:46:22: fatal error: G4Types.hh: No such file or directory
compilation terminated.
Making dependency for file src/G4ParameterisationPolyhedra.cc ...
include/G4VDivisionParameterisation.hh:46:22: fatal error: G4Types.hh: No such file or directory
compilation terminated.
Making dependency for file src/G4ParameterisationPolycone.cc ...
include/G4VDivisionParameterisation.hh:46:22: fatal error: G4Types.hh: No such file or directory
compilation terminated.
Making dependency for file src/G4ParameterisationPara.cc ...
include/G4VDivisionParameterisation.hh:46:22: fatal error: G4Types.hh: No such file or directory
compilation terminated.
Making dependency for file src/G4ParameterisationCons.cc ...
include/G4VDivisionParameterisation.hh:46:22: fatal error: G4Types.hh: No such file or directory
compilation terminated.
Making dependency for file src/G4ParameterisationBox.cc ...
include/G4VDivisionParameterisation.hh:46:22: fatal error: G4Types.hh: No such file or directory
compilation terminated.
Compiling G4ParameterisationBox.cc ...
In file included from include/G4ParameterisationBox.hh:47:0,
                 from src/G4ParameterisationBox.cc:37:
include/G4VDivisionParameterisation.hh:46:22: fatal error: G4Types.hh: No such file or directory
compilation terminated.
make[2]: *** [/home/adriana/geant4_workdir/tmp/Linux-g++/G4geomdivision/G4ParameterisationBox.o] Error 1
Making dependency for file src/G4Tubs.cc ...
include/G4CSGSolid.hh:48:23: fatal error: G4VSolid.hh: No such file or directory
compilation terminated.
Making dependency for file src/G4Trd.cc ...
include/G4CSGSolid.hh:48:23: fatal error: G4VSolid.hh: No such file or directory
compilation terminated.
Making dependency for file src/G4Trap.cc ...
include/G4CSGSolid.hh:48:23: fatal error: G4VSolid.hh: No such file or directory
compilation terminated.
Making dependency for file src/G4Torus.cc ...
include/G4CSGSolid.hh:48:23: fatal error: G4VSolid.hh: No such file or directory
compilation terminated.
Making dependency for file src/G4Sphere.cc ...
include/G4CSGSolid.hh:48:23: fatal error: G4VSolid.hh: No such file or directory
compilation terminated.
Making dependency for file src/G4Para.cc ...
include/G4CSGSolid.hh:48:23: fatal error: G4VSolid.hh: No such file or directory
compilation terminated.
Making dependency for file src/G4Orb.cc ...
include/G4CSGSolid.hh:48:23: fatal error: G4VSolid.hh: No such file or directory
compilation terminated.
Making dependency for file src/G4CutTubs.cc ...
include/G4CSGSolid.hh:48:23: fatal error: G4VSolid.hh: No such file or directory
compilation terminated.
Making dependency for file src/G4CSGSolid.cc ...
include/G4CSGSolid.hh:48:23: fatal error: G4VSolid.hh: No such file or directory
compilation terminated.
Making dependency for file src/G4Cons.cc ...
include/G4CSGSolid.hh:48:23: fatal error: G4VSolid.hh: No such file or directory
compilation terminated.
Making dependency for file src/G4Box.cc ...
include/G4CSGSolid.hh:48:23: fatal error: G4VSolid.hh: No such file or directory
compilation terminated.
Compiling G4Box.cc ...
In file included from include/G4Box.hh:53:0,
                 from src/G4Box.cc:43:
include/G4CSGSolid.hh:48:23: fatal error: G4VSolid.hh: No such file or directory
compilation terminated.
make[2]: *** [/home/adriana/geant4_workdir/tmp/Linux-g++/G4csg/G4Box.o] Error 1
Making dependency for file src/G4VTwistSurface.cc ...
include/G4VTwistSurface.hh:51:23: fatal error: G4VSolid.hh: No such file or directory
compilation terminated.
Making dependency for file src/G4VTwistedFaceted.cc ...
include/G4VTwistedFaceted.hh:50:23: fatal error: G4VSolid.hh: No such file or directory
compilation terminated.
Making dependency for file src/G4VFacet.cc ...
include/G4VFacet.hh:59:23: fatal error: G4VSolid.hh: No such file or directory
compilation terminated.
Making dependency for file src/G4VCSGfaceted.cc ...
include/G4VCSGfaceted.hh:49:23: fatal error: G4VSolid.hh: No such file or directory
compilation terminated.
Making dependency for file src/G4TwistTubsSide.cc ...
include/G4VTwistSurface.hh:51:23: fatal error: G4VSolid.hh: No such file or directory
compilation terminated.
Making dependency for file src/G4TwistTubsHypeSide.cc ...
include/G4VTwistSurface.hh:51:23: fatal error: G4VSolid.hh: No such file or directory
compilation terminated.
Making dependency for file src/G4TwistTubsFlatSide.cc ...
include/G4VTwistSurface.hh:51:23: fatal error: G4VSolid.hh: No such file or directory
compilation terminated.
Making dependency for file src/G4TwistTrapParallelSide.cc ...
include/G4VTwistSurface.hh:51:23: fatal error: G4VSolid.hh: No such file or directory
compilation terminated.
Making dependency for file src/G4TwistTrapFlatSide.cc ...
include/G4VTwistSurface.hh:51:23: fatal error: G4VSolid.hh: No such file or directory
compilation terminated.
Making dependency for file src/G4TwistTrapAlphaSide.cc ...
include/G4VTwistSurface.hh:51:23: fatal error: G4VSolid.hh: No such file or directory
compilation terminated.
Making dependency for file src/G4TwistedTubs.cc ...
include/G4TwistedTubs.hh:58:23: fatal error: G4VSolid.hh: No such file or directory
compilation terminated.
Making dependency for file src/G4TwistedTrd.cc ...
include/G4VTwistedFaceted.hh:50:23: fatal error: G4VSolid.hh: No such file or directory
compilation terminated.
Making dependency for file src/G4TwistedTrap.cc ...
include/G4VTwistedFaceted.hh:50:23: fatal error: G4VSolid.hh: No such file or directory
compilation terminated.
Making dependency for file src/G4TwistedBox.cc ...
include/G4VTwistedFaceted.hh:50:23: fatal error: G4VSolid.hh: No such file or directory
compilation terminated.
Making dependency for file src/G4TwistBoxSide.cc ...
include/G4VTwistSurface.hh:51:23: fatal error: G4VSolid.hh: No such file or directory
compilation terminated.
Making dependency for file src/G4TriangularFacet.cc ...
include/G4TriangularFacet.hh:71:22: fatal error: globals.hh: No such file or directory
compilation terminated.
Making dependency for file src/G4Tet.cc ...
include/G4Tet.hh:55:23: fatal error: G4VSolid.hh: No such file or directory
compilation terminated.
Making dependency for file src/G4TessellatedSolid.cc ...
include/G4TessellatedSolid.hh:112:23: fatal error: G4VSolid.hh: No such file or directory
compilation terminated.
Making dependency for file src/G4TessellatedGeometryAlgorithms.cc ...
include/G4TessellatedGeometryAlgorithms.hh:85:22: fatal error: globals.hh: No such file or directory
compilation terminated.
Making dependency for file src/G4SolidExtentList.cc ...
include/G4SolidExtentList.hh:51:22: fatal error: G4Types.hh: No such file or directory
compilation terminated.
Making dependency for file src/G4ReduciblePolygon.cc ...
include/G4ReduciblePolygon.hh:60:22: fatal error: G4Types.hh: No such file or directory
compilation terminated.

..........................................

Is there anything I am missing to be able to re-compile the libraries?

Thank you,

Cristian

Inline Depth:
 1 1
 All All
Outline Depth:
 1 1
 2 2
 All All
Add message: (add)

1 Note: Re: geant4.9.5 re-compillation of $G4INSTALL/source   (Ben Morgan - 09 Mar, 2012)
(_ More: Re: geant4.9.5 re-compillation of $G4INSTALL/source   (Cristian Bungau - 09 Mar, 2012)
 Add Message Add Message
to: "geant4.9.5 re-compillation of $G4INSTALL/source"

 Subscribe Subscribe

This site runs SLAC HyperNews version 1.11-slac-98, derived from the original HyperNews


[ Geant 4 Home | Geant 4 HyperNews | Search | Request New Forum | Feedback ]