Message: build error in the examples. String functions missing? Not Logged In (login)
 Next-in-Thread Next-in-Thread
 Next-in-Forum Next-in-Forum

Question build error in the examples. String functions missing? 

Forum: Installation and Configuration
Date: 11 May, 2009
From: Kosta Kliakhandler <Kosta Kliakhandler>

Hello, I'm running Geant4-4.9.0 as provided by the debian packages referenced from this page: http://wiki.debian.org/DebianScience/Geant4

When I try to build any of the sample experiments, I get an error such as this one (This is from N01, but for it is always 'strlen/strcmp was not declared in this scope'. Any tips? The error:

Compiling ExN01DetectorConstruction.cc ...
In file included from /usr/include/geant4/G4String.hh:190,
                 from /usr/include/geant4/globals.hh:65,
                 from /usr/include/geant4/G4VUserDetectorConstruction.hh:38,
                 from include/ExN01DetectorConstruction.hh:37,
                 from src/ExN01DetectorConstruction.cc:31:
/usr/include/geant4/G4String.icc: In member function ‘G4SubString& G4SubString::operator=(const char*)’:
/usr/include/geant4/G4String.icc:66: error: ‘strlen’ was not declared in this scope
/usr/include/geant4/G4String.icc: In member function ‘G4int G4String::strcasecompare(const char*, const char*) const’:
/usr/include/geant4/G4String.icc:251: error: ‘strlen’ was not declared in this scope
/usr/include/geant4/G4String.icc:259: error: ‘strcmp’ was not declared in this scope
/usr/include/geant4/G4String.icc: In member function ‘G4int G4String::compareTo(const char*, G4String::caseCompare)’:
/usr/include/geant4/G4String.icc:268: error: ‘strcmp’ was not declared in this scope
/usr/include/geant4/G4String.icc: In member function ‘G4int G4String::compareTo(const G4String&, G4String::caseCompare)’:
/usr/include/geant4/G4String.icc:276: error: ‘strcmp’ was not declared in this scope
make: *** [/home/kosta/geant/novice/N01/tmp/Linux-g++/exampleN01/ExN01DetectorConstruction.o] Error 1

Thanks in advance, Kosta.

Inline Depth:
 1 1
 All All
Outline Depth:
 1 1
 2 2
 All All
Add message: (add)

1 None: Re: build error in the examples. String functions missing?   (Joseph Perl - 11 May, 2009)
(_ None: Re: build error in the examples. String functions missing?   (Kliakhandler Kosta - 17 May, 2009)
 Add Message Add Message
to: "build error in the examples. String functions missing?"

 Subscribe Subscribe

This site runs SLAC HyperNews version 1.11-slac-98, derived from the original HyperNews


[ Geant 4 Home | Geant 4 HyperNews | Search | Request New Forum | Feedback ]