Message: problems in geant4.9.5 on the way to parallel Not Logged In (login)
 Next-in-Thread Next-in-Thread
 Next-in-Forum Next-in-Forum

Question problems in geant4.9.5 on the way to parallel 

Forum: Fast Simulation, Transportation & Others
Date: 22 Mar, 2012
From: Geng <Geng>

Dear sir/madam:

        Thanks in advance!
        I want to do some parallel work with geant4.9.5,but I make failed with mpi-interface.There are so many errors. Could you please give me some advice?
        This is the error in the terminal.
        Thanks very much!

geng

In file included from src/G4VMPIsession.cc:34:
include/G4VMPIsession.hh:37:28: error: G4VBasicShell.hh: No such file or directory
In file included from src/G4VMPIsession.cc:35:
include/G4MPImanager.hh:38:22: error: globals.hh: No such file or directory
src/G4VMPIsession.cc:36:26: error: G4UImanager.hh: No such file or directory
src/G4VMPIsession.cc:37:26: error: G4UIcommand.hh: No such file or directory
Making dependency for file src/G4VMPIseedGenerator.cc ...
In file included from src/G4VMPIseedGenerator.cc:33:
include/G4VMPIseedGenerator.hh:37:22: error: globals.hh: No such file or directory
Making dependency for file src/G4UImpish.cc ...
In file included from src/G4UImpish.cc:34:
include/G4UImpish.hh:38:25: error: G4VUIshell.hh: No such file or directory
Making dependency for file src/G4MPIstatus.cc ...
In file included from src/G4MPIstatus.cc:34:
include/G4MPIstatus.hh:37:22: error: globals.hh: No such file or directory
include/G4MPIstatus.hh:38:33: error: G4ApplicationState.hh: No such file or directory
include/G4MPIstatus.hh:39:22: error: G4Timer.hh: No such file or directory
src/G4MPIstatus.cc:35:33: error: G4ApplicationState.hh: No such file or directory
Making dependency for file src/G4MPIsession.cc ...
In file included from include/G4MPIsession.hh:37,
                 from src/G4MPIsession.cc:34:
include/G4VMPIsession.hh:37:28: error: G4VBasicShell.hh: No such file or directory
In file included from src/G4MPIsession.cc:35:
include/G4MPImanager.hh:38:22: error: globals.hh: No such file or directory
src/G4MPIsession.cc:36:27: error: G4RunManager.hh: No such file or directory
src/G4MPIsession.cc:37:26: error: G4UImanager.hh: No such file or directory
src/G4MPIsession.cc:38:26: error: G4UIcommand.hh: No such file or directory
src/G4MPIsession.cc:39:22: error: G4UIcsh.hh: No such file or directory
In file included from src/G4MPIsession.cc:40:
include/G4UImpish.hh:38:25: error: G4VUIshell.hh: No such file or directory
Making dependency for file src/G4MPIrandomSeedGenerator.cc ...
In file included from include/G4MPIrandomSeedGenerator.hh:37,
                 from src/G4MPIrandomSeedGenerator.cc:34:
include/G4VMPIseedGenerator.hh:37:22: error: globals.hh: No such file or directory
src/G4MPIrandomSeedGenerator.cc:36:24: error: Randomize.hh: No such file or directory
Making dependency for file src/G4MPImessenger.cc ...
In file included from src/G4MPImessenger.cc:34:
include/G4MPImessenger.hh:37:28: error: G4UImessenger.hh: No such file or directory
In file included from src/G4MPImessenger.cc:35:
include/G4MPImanager.hh:38:22: error: globals.hh: No such file or directory
src/G4MPImessenger.cc:37:28: error: G4UIdirectory.hh: No such file or directory
src/G4MPImessenger.cc:38:38: error: G4UIcmdWithoutParameter.hh: No such file or directory
src/G4MPImessenger.cc:39:35: error: G4UIcmdWithAnInteger.hh: No such file or directory
src/G4MPImessenger.cc:40:33: error: G4UIcmdWithAString.hh: No such file or directory
src/G4MPImessenger.cc:41:33: error: G4UIcmdWithADouble.hh: No such file or directory
src/G4MPImessenger.cc:42:26: error: G4UIcommand.hh: No such file or directory
src/G4MPImessenger.cc:43:28: error: G4UIparameter.hh: No such file or directory
Making dependency for file src/G4MPImanager.cc ...
In file included from src/G4MPImanager.cc:34:
include/G4MPImanager.hh:38:22: error: globals.hh: No such file or directory
In file included from src/G4MPImanager.cc:35:
include/G4MPImessenger.hh:37:28: error: G4UImessenger.hh: No such file or directory
In file included from include/G4MPIsession.hh:37,
                 from src/G4MPImanager.cc:36:
include/G4VMPIsession.hh:37:28: error: G4VBasicShell.hh: No such file or directory
In file included from src/G4MPImanager.cc:38:
include/G4MPIstatus.hh:38:33: error: G4ApplicationState.hh: No such file or directory
include/G4MPIstatus.hh:39:22: error: G4Timer.hh: No such file or directory
src/G4MPImanager.cc:40:26: error: G4UImanager.hh: No such file or directory
src/G4MPImanager.cc:41:27: error: G4RunManager.hh: No such file or directory
src/G4MPImanager.cc:42:29: error: G4StateManager.hh: No such file or directory
src/G4MPImanager.cc:43:20: error: G4Run.hh: No such file or directory
Making dependency for file src/G4MPIbatch.cc ...
In file included from include/G4MPIbatch.hh:37,
                 from src/G4MPIbatch.cc:34:
include/G4VMPIsession.hh:37:28: error: G4VBasicShell.hh: No such file or directory
In file included from src/G4MPIbatch.cc:35:
include/G4MPImanager.hh:38:22: error: globals.hh: No such file or directory
src/G4MPIbatch.cc:36:26: error: G4UImanager.hh: No such file or directory
src/G4MPIbatch.cc:37:32: error: G4UIcommandStatus.hh: No such file or directory
Compiling G4MPIbatch.cc ...
In file included from include/G4MPIbatch.hh:37,
                 from src/G4MPIbatch.cc:34:
include/G4VMPIsession.hh:37:28: error: G4VBasicShell.hh: No such file or directory
In file included from src/G4MPIbatch.cc:35:
include/G4MPImanager.hh:38:22: error: globals.hh: No such file or directory
src/G4MPIbatch.cc:36:26: error: G4UImanager.hh: No such file or directory
src/G4MPIbatch.cc:37:32: error: G4UIcommandStatus.hh: No such file or directory
include/G4VMPIsession.hh:50: error: expected class-name before ‘{’ token
include/G4VMPIsession.hh:56: error: ‘G4bool’ does not name a type
include/G4VMPIsession.hh:57: error: ‘G4bool’ does not name a type
include/G4VMPIsession.hh:58: error: ‘G4int’ does not name a type
include/G4VMPIsession.hh:60: error: ‘G4int’ does not name a type
include/G4VMPIsession.hh:61: error: ‘G4String’ does not name a type
include/G4VMPIsession.hh:62: error: ‘G4String’ does not name a type
include/G4VMPIsession.hh:65: error: ‘G4bool’ does not name a type
include/G4VMPIsession.hh:73: error: ‘G4String’ has not been declared
include/G4VMPIsession.hh:75: error: ‘G4int’ does not name a type
include/G4VMPIsession.hh:76: error: ‘G4int’ does not name a type
include/G4MPIbatch.hh:49: error: ‘G4bool’ does not name a type
include/G4MPIbatch.hh:50: error: ‘G4bool’ does not name a type
include/G4MPIbatch.hh:53: error: ‘G4String’ does not name a type
include/G4MPIbatch.hh:56: error: expected ‘,’ or ‘...’ before ‘&’ token
include/G4MPIbatch.hh:56: error: ISO C++ forbids declaration of ‘G4String’ with no type
include/G4MPIbatch.hh:60: error: ISO C++ forbids declaration of ‘G4UIsession’ with no type
include/G4MPIbatch.hh:60: error: ‘G4UIsession’ declared as a ‘virtual’ field
include/G4MPIbatch.hh:60: error: expected ‘;’ before ‘*’ token
include/G4MPImanager.hh:58: error: ‘G4int’ does not name a type
include/G4MPImanager.hh:62: error: ‘G4bool’ does not name a type
include/G4MPImanager.hh:63: error: ‘G4bool’ does not name a type
include/G4MPImanager.hh:64: error: ‘G4int’ does not name a type
include/G4MPImanager.hh:65: error: ‘G4int’ does not name a type
include/G4MPImanager.hh:71: error: ‘G4bool’ does not name a type
include/G4MPImanager.hh:75: error: ‘G4bool’ does not name a type
include/G4MPImanager.hh:76: error: ‘G4String’ does not name a type
include/G4MPImanager.hh:77: error: ‘G4bool’ does not name a type
include/G4MPImanager.hh:78: error: ‘G4String’ does not name a type
include/G4MPImanager.hh:82: error: ‘G4int’ has not been declared
include/G4MPImanager.hh:83: error: ‘G4int’ has not been declared
include/G4MPImanager.hh:93: error: ‘G4double’ does not name a type
include/G4MPImanager.hh:117: error: ‘G4int’ does not name a type
include/G4MPImanager.hh:118: error: ‘G4int’ has not been declared
include/G4MPImanager.hh:120: error: ‘G4int’ does not name a type
include/G4MPImanager.hh:121: error: ‘G4int’ does not name a type
include/G4MPImanager.hh:123: error: ‘G4bool’ does not name a type
include/G4MPImanager.hh:124: error: ‘G4bool’ does not name a type
include/G4MPImanager.hh:126: error: ‘G4bool’ does not name a type
include/G4MPImanager.hh:127: error: ISO C++ forbids declaration of ‘G4String’ with no type
include/G4MPImanager.hh:127: error: expected ‘;’ before ‘&’ token
include/G4MPImanager.hh:129: error: ‘G4bool’ does not name a type
include/G4MPImanager.hh:130: error: ISO C++ forbids declaration of ‘G4String’ with no type
include/G4MPImanager.hh:130: error: expected ‘;’ before ‘&’ token
include/G4MPImanager.hh:132: error: ‘G4double’ has not been declared
include/G4MPImanager.hh:133: error: ‘G4double’ does not name a type
include/G4MPImanager.hh:138: error: ‘G4String’ does not name a type
include/G4MPImanager.hh:141: error: ‘G4int’ has not been declared
include/G4MPImanager.hh:141: error: ‘G4long’ has not been declared
include/G4MPImanager.hh:146: error: expected ‘,’ or ‘...’ before ‘&’ token
include/G4MPImanager.hh:146: error: ISO C++ forbids declaration of ‘G4String’ with no type
include/G4MPImanager.hh:147: error: ‘G4bool’ does not name a type
include/G4MPImanager.hh:148: error: expected ‘,’ or ‘...’ before ‘&’ token
include/G4MPImanager.hh:148: error: ISO C++ forbids declaration of ‘G4String’ with no type
include/G4MPImanager.hh:149: error: expected ‘,’ or ‘...’ before ‘&’ token
include/G4MPImanager.hh:149: error: ISO C++ forbids declaration of ‘G4String’ with no type
include/G4MPImanager.hh:152: error: ‘G4int’ has not been declared
include/G4MPImanager.hh:152: error: ‘G4bool’ has not been declared
include/G4MPImanager.hh:153: error: expected ‘,’ or ‘...’ before ‘&’ token
include/G4MPImanager.hh:153: error: ISO C++ forbids declaration of ‘G4String’ with no type
include/G4MPImanager.hh:169: error: ‘G4int’ does not name a type
include/G4MPImanager.hh:174: error: variable or field ‘SetVerbose’ declared void
include/G4MPImanager.hh:174: error: ‘G4MPImanager::SetVerbose’ declared as an ‘inline’ variable
include/G4MPImanager.hh:174: error: ‘int G4MPImanager::SetVerbose’ is not a static member of ‘class G4MPImanager’
include/G4MPImanager.hh:174: error: ‘G4int’ was not declared in this scope
include/G4MPImanager.hh:175: error: expected ‘,’ or ‘;’ before ‘{’ token
include/G4MPImanager.hh:184: error: ‘G4int’ does not name a type
include/G4MPImanager.hh:189: error: ‘G4int’ does not name a type
include/G4MPImanager.hh:194: error: ‘G4bool’ does not name a type
include/G4MPImanager.hh:199: error: ‘G4bool’ does not name a type
include/G4MPImanager.hh:204: error: ‘G4bool’ does not name a type
include/G4MPImanager.hh:210: error: expected initializer before ‘&’ token
include/G4MPImanager.hh:216: error: ‘G4bool’ does not name a type
include/G4MPImanager.hh:221: error: expected initializer before ‘&’ token
include/G4MPImanager.hh:226: error: variable or field ‘SetMasterWeight’ declared void
include/G4MPImanager.hh:226: error: ‘G4MPImanager::SetMasterWeight’ declared as an ‘inline’ variable
include/G4MPImanager.hh:226: error: ‘int G4MPImanager::SetMasterWeight’ is not a static member of ‘class G4MPImanager’
include/G4MPImanager.hh:226: error: ‘G4double’ was not declared in this scope
include/G4MPImanager.hh:227: error: expected ‘,’ or ‘;’ before ‘{’ token
include/G4MPImanager.hh:234: error: ‘G4double’ does not name a type
src/G4MPIbatch.cc:41: error: expected ‘,’ or ‘...’ before ‘&’ token
src/G4MPIbatch.cc:41: error: ISO C++ forbids declaration of ‘G4String’ with no type
src/G4MPIbatch.cc: In function ‘void Tokenize(int)’:
src/G4MPIbatch.cc:46: error: ‘str_size’ was not declared in this scope
src/G4MPIbatch.cc:46: error: expected `;' before ‘pos0’
src/G4MPIbatch.cc:47: error: expected `;' before ‘pos’
src/G4MPIbatch.cc:49: error: ‘pos’ was not declared in this scope
src/G4MPIbatch.cc:49: error: ‘G4String’ is not a class or namespace
src/G4MPIbatch.cc:49: error: ‘pos0’ was not declared in this scope
src/G4MPIbatch.cc:49: error: ‘G4String’ is not a class or namespace
src/G4MPIbatch.cc:50: error: ‘str’ was not declared in this scope
src/G4MPIbatch.cc:52: error: ‘G4String’ is not a class or namespace
src/G4MPIbatch.cc:54: error: ‘str’ was not declared in this scope
src/G4MPIbatch.cc:56: error: ‘G4String’ is not a class or namespace
src/G4MPIbatch.cc:59: error: ‘tokens’ was not declared in this scope
src/G4MPIbatch.cc:59: error: ‘str’ was not declared in this scope
src/G4MPIbatch.cc: At global scope:
src/G4MPIbatch.cc:72: error: expected ‘,’ or ‘...’ before ‘&’ token
src/G4MPIbatch.cc:72: error: ISO C++ forbids declaration of ‘G4String’ with no type
src/G4MPIbatch.cc: In constructor ‘G4MPIbatch::G4MPIbatch(int)’:
src/G4MPIbatch.cc:74: error: class ‘G4MPIbatch’ does not have any field named ‘isOpened’
src/G4MPIbatch.cc:74: error: class ‘G4MPIbatch’ does not have any field named ‘isBatchMode’
src/G4MPIbatch.cc:74: error: ‘qbatch’ was not declared in this scope
src/G4MPIbatch.cc:77: error: ‘isMaster’ was not declared in this scope
src/G4MPIbatch.cc:78: error: ‘fname’ was not declared in this scope
src/G4MPIbatch.cc:80: error: ‘G4cerr’ was not declared in this scope
src/G4MPIbatch.cc:81: error: ‘G4endl’ was not declared in this scope
src/G4MPIbatch.cc:83: error: ‘isOpened’ was not declared in this scope
src/G4MPIbatch.cc: In destructor ‘G4MPIbatch::~G4MPIbatch()’:
src/G4MPIbatch.cc:93: error: ‘isOpened’ was not declared in this scope
src/G4MPIbatch.cc: At global scope:
src/G4MPIbatch.cc:98: error: ‘G4String’ does not name a type
src/G4MPIbatch.cc:169: error: expected constructor, destructor, or type conversion before ‘*’ token
make: *** [/gpfs/g4.9.5/g4work/tmp/Linux-g++/G4UImpi/G4MPIbatch.o] Error 1
[root@mgt mpi_interface]# cd ..
[root@mgt MPI]# cd mpi_interface/
[root@mgt mpi_interface]# make clean
Cleaning up ...
[root@mgt mpi_interface]# make
Making dependency for file src/G4VMPIsession.cc ...
In file included from src/G4VMPIsession.cc:34:
include/G4VMPIsession.hh:37:28: error: G4VBasicShell.hh: No such file or directory
In file included from src/G4VMPIsession.cc:35:
include/G4MPImanager.hh:38:22: error: globals.hh: No such file or directory
src/G4VMPIsession.cc:36:26: error: G4UImanager.hh: No such file or directory
src/G4VMPIsession.cc:37:26: error: G4UIcommand.hh: No such file or directory
Making dependency for file src/G4VMPIseedGenerator.cc ...
In file included from src/G4VMPIseedGenerator.cc:33:
include/G4VMPIseedGenerator.hh:37:22: error: globals.hh: No such file or directory
Making dependency for file src/G4UImpish.cc ...
In file included from src/G4UImpish.cc:34:
include/G4UImpish.hh:38:25: error: G4VUIshell.hh: No such file or directory
Making dependency for file src/G4MPIstatus.cc ...
In file included from src/G4MPIstatus.cc:34:
include/G4MPIstatus.hh:37:22: error: globals.hh: No such file or directory
include/G4MPIstatus.hh:38:33: error: G4ApplicationState.hh: No such file or directory
include/G4MPIstatus.hh:39:22: error: G4Timer.hh: No such file or directory
src/G4MPIstatus.cc:35:33: error: G4ApplicationState.hh: No such file or directory
Making dependency for file src/G4MPIsession.cc ...
In file included from include/G4MPIsession.hh:37,
                 from src/G4MPIsession.cc:34:
include/G4VMPIsession.hh:37:28: error: G4VBasicShell.hh: No such file or directory
In file included from src/G4MPIsession.cc:35:
include/G4MPImanager.hh:38:22: error: globals.hh: No such file or directory
src/G4MPIsession.cc:36:27: error: G4RunManager.hh: No such file or directory
src/G4MPIsession.cc:37:26: error: G4UImanager.hh: No such file or directory
src/G4MPIsession.cc:38:26: error: G4UIcommand.hh: No such file or directory
src/G4MPIsession.cc:39:22: error: G4UIcsh.hh: No such file or directory
In file included from src/G4MPIsession.cc:40:
include/G4UImpish.hh:38:25: error: G4VUIshell.hh: No such file or directory
Making dependency for file src/G4MPIrandomSeedGenerator.cc ...
In file included from include/G4MPIrandomSeedGenerator.hh:37,
                 from src/G4MPIrandomSeedGenerator.cc:34:
include/G4VMPIseedGenerator.hh:37:22: error: globals.hh: No such file or directory
src/G4MPIrandomSeedGenerator.cc:36:24: error: Randomize.hh: No such file or directory
Making dependency for file src/G4MPImessenger.cc ...
In file included from src/G4MPImessenger.cc:34:
include/G4MPImessenger.hh:37:28: error: G4UImessenger.hh: No such file or directory
In file included from src/G4MPImessenger.cc:35:
include/G4MPImanager.hh:38:22: error: globals.hh: No such file or directory
src/G4MPImessenger.cc:37:28: error: G4UIdirectory.hh: No such file or directory
src/G4MPImessenger.cc:38:38: error: G4UIcmdWithoutParameter.hh: No such file or directory
src/G4MPImessenger.cc:39:35: error: G4UIcmdWithAnInteger.hh: No such file or directory
src/G4MPImessenger.cc:40:33: error: G4UIcmdWithAString.hh: No such file or directory
src/G4MPImessenger.cc:41:33: error: G4UIcmdWithADouble.hh: No such file or directory
src/G4MPImessenger.cc:42:26: error: G4UIcommand.hh: No such file or directory
src/G4MPImessenger.cc:43:28: error: G4UIparameter.hh: No such file or directory
Making dependency for file src/G4MPImanager.cc ...
In file included from src/G4MPImanager.cc:34:
include/G4MPImanager.hh:38:22: error: globals.hh: No such file or directory
In file included from src/G4MPImanager.cc:35:
include/G4MPImessenger.hh:37:28: error: G4UImessenger.hh: No such file or directory
In file included from include/G4MPIsession.hh:37,
                 from src/G4MPImanager.cc:36:
include/G4VMPIsession.hh:37:28: error: G4VBasicShell.hh: No such file or directory
In file included from src/G4MPImanager.cc:38:
include/G4MPIstatus.hh:38:33: error: G4ApplicationState.hh: No such file or directory
include/G4MPIstatus.hh:39:22: error: G4Timer.hh: No such file or directory
src/G4MPImanager.cc:40:26: error: G4UImanager.hh: No such file or directory
src/G4MPImanager.cc:41:27: error: G4RunManager.hh: No such file or directory
src/G4MPImanager.cc:42:29: error: G4StateManager.hh: No such file or directory
src/G4MPImanager.cc:43:20: error: G4Run.hh: No such file or directory
Making dependency for file src/G4MPIbatch.cc ...
In file included from include/G4MPIbatch.hh:37,
                 from src/G4MPIbatch.cc:34:
include/G4VMPIsession.hh:37:28: error: G4VBasicShell.hh: No such file or directory
In file included from src/G4MPIbatch.cc:35:
include/G4MPImanager.hh:38:22: error: globals.hh: No such file or directory
src/G4MPIbatch.cc:36:26: error: G4UImanager.hh: No such file or directory
src/G4MPIbatch.cc:37:32: error: G4UIcommandStatus.hh: No such file or directory
Compiling G4MPIbatch.cc ...
In file included from include/G4MPIbatch.hh:37,
                 from src/G4MPIbatch.cc:34:
include/G4VMPIsession.hh:37:28: error: G4VBasicShell.hh: No such file or directory
In file included from src/G4MPIbatch.cc:35:
include/G4MPImanager.hh:38:22: error: globals.hh: No such file or directory
src/G4MPIbatch.cc:36:26: error: G4UImanager.hh: No such file or directory
src/G4MPIbatch.cc:37:32: error: G4UIcommandStatus.hh: No such file or directory
include/G4VMPIsession.hh:50: error: expected class-name before ‘{’ token
include/G4VMPIsession.hh:56: error: ‘G4bool’ does not name a type
include/G4VMPIsession.hh:57: error: ‘G4bool’ does not name a type
include/G4VMPIsession.hh:58: error: ‘G4int’ does not name a type
include/G4VMPIsession.hh:60: error: ‘G4int’ does not name a type
include/G4VMPIsession.hh:61: error: ‘G4String’ does not name a type
include/G4VMPIsession.hh:62: error: ‘G4String’ does not name a type
include/G4VMPIsession.hh:65: error: ‘G4bool’ does not name a type
include/G4VMPIsession.hh:73: error: ‘G4String’ has not been declared
include/G4VMPIsession.hh:75: error: ‘G4int’ does not name a type
include/G4VMPIsession.hh:76: error: ‘G4int’ does not name a type
include/G4MPIbatch.hh:49: error: ‘G4bool’ does not name a type
include/G4MPIbatch.hh:50: error: ‘G4bool’ does not name a type
include/G4MPIbatch.hh:53: error: ‘G4String’ does not name a type
include/G4MPIbatch.hh:56: error: expected ‘,’ or ‘...’ before ‘&’ token
include/G4MPIbatch.hh:56: error: ISO C++ forbids declaration of ‘G4String’ with no type
include/G4MPIbatch.hh:60: error: ISO C++ forbids declaration of ‘G4UIsession’ with no type
include/G4MPIbatch.hh:60: error: ‘G4UIsession’ declared as a ‘virtual’ field
include/G4MPIbatch.hh:60: error: expected ‘;’ before ‘*’ token
include/G4MPImanager.hh:58: error: ‘G4int’ does not name a type
include/G4MPImanager.hh:62: error: ‘G4bool’ does not name a type
include/G4MPImanager.hh:63: error: ‘G4bool’ does not name a type
include/G4MPImanager.hh:64: error: ‘G4int’ does not name a type
include/G4MPImanager.hh:65: error: ‘G4int’ does not name a type
include/G4MPImanager.hh:71: error: ‘G4bool’ does not name a type
include/G4MPImanager.hh:75: error: ‘G4bool’ does not name a type
include/G4MPImanager.hh:76: error: ‘G4String’ does not name a type
include/G4MPImanager.hh:77: error: ‘G4bool’ does not name a type
include/G4MPImanager.hh:78: error: ‘G4String’ does not name a type
include/G4MPImanager.hh:82: error: ‘G4int’ has not been declared
include/G4MPImanager.hh:83: error: ‘G4int’ has not been declared
include/G4MPImanager.hh:93: error: ‘G4double’ does not name a type
include/G4MPImanager.hh:117: error: ‘G4int’ does not name a type
include/G4MPImanager.hh:118: error: ‘G4int’ has not been declared
include/G4MPImanager.hh:120: error: ‘G4int’ does not name a type
include/G4MPImanager.hh:121: error: ‘G4int’ does not name a type
include/G4MPImanager.hh:123: error: ‘G4bool’ does not name a type
include/G4MPImanager.hh:124: error: ‘G4bool’ does not name a type
include/G4MPImanager.hh:126: error: ‘G4bool’ does not name a type
include/G4MPImanager.hh:127: error: ISO C++ forbids declaration of ‘G4String’ with no type
include/G4MPImanager.hh:127: error: expected ‘;’ before ‘&’ token
include/G4MPImanager.hh:129: error: ‘G4bool’ does not name a type
include/G4MPImanager.hh:130: error: ISO C++ forbids declaration of ‘G4String’ with no type
include/G4MPImanager.hh:130: error: expected ‘;’ before ‘&’ token
include/G4MPImanager.hh:132: error: ‘G4double’ has not been declared
include/G4MPImanager.hh:133: error: ‘G4double’ does not name a type
include/G4MPImanager.hh:138: error: ‘G4String’ does not name a type
include/G4MPImanager.hh:141: error: ‘G4int’ has not been declared
include/G4MPImanager.hh:141: error: ‘G4long’ has not been declared
include/G4MPImanager.hh:146: error: expected ‘,’ or ‘...’ before ‘&’ token
include/G4MPImanager.hh:146: error: ISO C++ forbids declaration of ‘G4String’ with no type
include/G4MPImanager.hh:147: error: ‘G4bool’ does not name a type
include/G4MPImanager.hh:148: error: expected ‘,’ or ‘...’ before ‘&’ token
include/G4MPImanager.hh:148: error: ISO C++ forbids declaration of ‘G4String’ with no type
include/G4MPImanager.hh:149: error: expected ‘,’ or ‘...’ before ‘&’ token
include/G4MPImanager.hh:149: error: ISO C++ forbids declaration of ‘G4String’ with no type
include/G4MPImanager.hh:152: error: ‘G4int’ has not been declared
include/G4MPImanager.hh:152: error: ‘G4bool’ has not been declared
include/G4MPImanager.hh:153: error: expected ‘,’ or ‘...’ before ‘&’ token
include/G4MPImanager.hh:153: error: ISO C++ forbids declaration of ‘G4String’ with no type
include/G4MPImanager.hh:169: error: ‘G4int’ does not name a type
include/G4MPImanager.hh:174: error: variable or field ‘SetVerbose’ declared void
include/G4MPImanager.hh:174: error: ‘G4MPImanager::SetVerbose’ declared as an ‘inline’ variable
include/G4MPImanager.hh:174: error: ‘int G4MPImanager::SetVerbose’ is not a static member of ‘class G4MPImanager’
include/G4MPImanager.hh:174: error: ‘G4int’ was not declared in this scope
include/G4MPImanager.hh:175: error: expected ‘,’ or ‘;’ before ‘{’ token
include/G4MPImanager.hh:184: error: ‘G4int’ does not name a type
include/G4MPImanager.hh:189: error: ‘G4int’ does not name a type
include/G4MPImanager.hh:194: error: ‘G4bool’ does not name a type
include/G4MPImanager.hh:199: error: ‘G4bool’ does not name a type
include/G4MPImanager.hh:204: error: ‘G4bool’ does not name a type
include/G4MPImanager.hh:210: error: expected initializer before ‘&’ token
include/G4MPImanager.hh:216: error: ‘G4bool’ does not name a type
include/G4MPImanager.hh:221: error: expected initializer before ‘&’ token
include/G4MPImanager.hh:226: error: variable or field ‘SetMasterWeight’ declared void
include/G4MPImanager.hh:226: error: ‘G4MPImanager::SetMasterWeight’ declared as an ‘inline’ variable
include/G4MPImanager.hh:226: error: ‘int G4MPImanager::SetMasterWeight’ is not a static member of ‘class G4MPImanager’
include/G4MPImanager.hh:226: error: ‘G4double’ was not declared in this scope
include/G4MPImanager.hh:227: error: expected ‘,’ or ‘;’ before ‘{’ token
include/G4MPImanager.hh:234: error: ‘G4double’ does not name a type
src/G4MPIbatch.cc:41: error: expected ‘,’ or ‘...’ before ‘&’ token
src/G4MPIbatch.cc:41: error: ISO C++ forbids declaration of ‘G4String’ with no type
src/G4MPIbatch.cc: In function ‘void Tokenize(int)’:
src/G4MPIbatch.cc:46: error: ‘str_size’ was not declared in this scope
src/G4MPIbatch.cc:46: error: expected `;' before ‘pos0’
src/G4MPIbatch.cc:47: error: expected `;' before ‘pos’
src/G4MPIbatch.cc:49: error: ‘pos’ was not declared in this scope
src/G4MPIbatch.cc:49: error: ‘G4String’ is not a class or namespace
src/G4MPIbatch.cc:49: error: ‘pos0’ was not declared in this scope
src/G4MPIbatch.cc:49: error: ‘G4String’ is not a class or namespace
src/G4MPIbatch.cc:50: error: ‘str’ was not declared in this scope
src/G4MPIbatch.cc:52: error: ‘G4String’ is not a class or namespace
src/G4MPIbatch.cc:54: error: ‘str’ was not declared in this scope
src/G4MPIbatch.cc:56: error: ‘G4String’ is not a class or namespace
src/G4MPIbatch.cc:59: error: ‘tokens’ was not declared in this scope
src/G4MPIbatch.cc:59: error: ‘str’ was not declared in this scope
src/G4MPIbatch.cc: At global scope:
src/G4MPIbatch.cc:72: error: expected ‘,’ or ‘...’ before ‘&’ token
src/G4MPIbatch.cc:72: error: ISO C++ forbids declaration of ‘G4String’ with no type
src/G4MPIbatch.cc: In constructor ‘G4MPIbatch::G4MPIbatch(int)’:
src/G4MPIbatch.cc:74: error: class ‘G4MPIbatch’ does not have any field named ‘isOpened’
src/G4MPIbatch.cc:74: error: class ‘G4MPIbatch’ does not have any field named ‘isBatchMode’
src/G4MPIbatch.cc:74: error: ‘qbatch’ was not declared in this scope
src/G4MPIbatch.cc:77: error: ‘isMaster’ was not declared in this scope
src/G4MPIbatch.cc:78: error: ‘fname’ was not declared in this scope
src/G4MPIbatch.cc:80: error: ‘G4cerr’ was not declared in this scope
src/G4MPIbatch.cc:81: error: ‘G4endl’ was not declared in this scope
src/G4MPIbatch.cc:83: error: ‘isOpened’ was not declared in this scope
src/G4MPIbatch.cc: In destructor ‘G4MPIbatch::~G4MPIbatch()’:
src/G4MPIbatch.cc:93: error: ‘isOpened’ was not declared in this scope
src/G4MPIbatch.cc: At global scope:
src/G4MPIbatch.cc:98: error: ‘G4String’ does not name a type
src/G4MPIbatch.cc:169: error: expected constructor, destructor, or type conversion before ‘*’ token
make: *** [/gpfs/g4.9.5/g4work/tmp/Linux-g++/G4UImpi/G4MPIbatch.o] Error 1

 Add Message Add Message
to: "problems in geant4.9.5 on the way to parallel"

 Subscribe Subscribe

This site runs SLAC HyperNews version 1.11-slac-98, derived from the original HyperNews


[ Geant 4 Home | Geant 4 HyperNews | Search | Request New Forum | Feedback ]