Message: fatal error compiling example chem3 Not Logged In (login)
 Next-in-Thread Next-in-Thread
 Next-in-Forum Next-in-Forum

Question fatal error compiling example chem3 

Forum: Documentation and Examples
Date: 18 Mar, 2016
From: Bigot Mathilde <Bigot Mathilde>

Dear All,
I am facing a new problem compiling an example in the section extended/medical/dna. I use cmake to compile. I have no problem with the following command :
 cmake -DGEANT4_DIR=path-to-geant4-install/lib/Geant4-10.2.1/ ../chem3
But when I launch the make, I get this message :
chem3.cc:52:21: fatal error: G4UIQt.hh:No such file or directory #include "G4UIQt.hh"
compilation terminated.
make[3]: *** [CMakeFiles/chem3.cc.o] Error 1
make[2]: *** [CMakeFiles/chem3.dir/all] Error 2
make[1]: *** [CMakeFiles/chem3.dir/rule] Error2
make: *** [chem3] Error 2

I had no problem with Qt running the basic examples, so I don't know what is wrong, so your help is very welcome.

Thank you,

Bests, M. Bigot

Inline Depth:
 1 1
 All All
Outline Depth:
 1 1
 2 2
 All All
Add message: (add)

1 None: Re: fatal error compiling example chem3   (Ivana Hrivnacova - 21 Mar, 2016)
1 None: Re: fatal error compiling example chem3   (Bigot Mathilde - 21 Mar, 2016)
2 Ok: Re: fatal error compiling example chem3   (Bigot Mathilde - 21 Mar, 2016)
 Add Message Add Message
to: "fatal error compiling example chem3"

 Subscribe Subscribe

This site runs SLAC HyperNews version 1.11-slac-98, derived from the original HyperNews


[ Geant 4 Home | Geant 4 HyperNews | Search | Request New Forum | Feedback ]