Message: running examples Not Logged In (login)
 Next-in-Thread Next-in-Thread
 Next-in-Forum Next-in-Forum

Question running examples 

Forum: Documentation and Examples
Date: 13 Dec, 2014
From: Adel Pirnia <Adel Pirnia>

Hello all, I tried to run examples many times and modifying their codes, there was not any problem, last night after a couple mounts my linux needed some updates, and today when I tried to run examples with their original or modified code, these messages appeared: Scanning dependencies of target exampleB3

[ 12%] [ 25%] [ 37%] [ 50%] Building CXX object

CMakeFiles/exampleB3.dir/exampleB3.cc.o

Building CXX object CMakeFiles/exampleB3.dir/src/B3ActionInitialization.cc.o

Building CXX object CMakeFiles/exampleB3.dir/src/B3RunAction.cc.o

Building CXX object CMakeFiles/exampleB3.dir/src/B3StackingAction.cc.o

[ 62%] Building CXX object

CMakeFiles/exampleB3.dir/src/B3DetectorConstruction.cc.o

[ 75%] Building CXX object CMakeFiles/exampleB3.dir/src/B3PhysicsList.cc.o

[ 87%] Building CXX object CMakeFiles/exampleB3.dir/src/B3Run.cc.o

make[3]: *** No rule to make target `/usr/lib/libGL.so', needed by `exampleB3'.

Stop.

make[3]: *** Waiting for unfinished jobs....

[100%] Building CXX object

CMakeFiles/exampleB3.dir/src/B3PrimaryGeneratorAction.cc.o

make[2]: *** [CMakeFiles/exampleB3.dir/all] Error 2

make[1]: *** [CMakeFiles/exampleB3.dir/rule] Error 2

make: *** [exampleB3] Error 2

root@adel-X450LCP:/home/adel/eee/B3-build# /usr/bin/gcc

gcc: fatal error: no input files

compilation terminated.

Its your high greatness to help me solve it

Inline Depth:
 1 1
 All All
Outline Depth:
 1 1
 2 2
 All All
Add message: (add)

1 None: Re: running examples   (Ivana Hrivnacova - 14 Jan, 2015)
 Add Message Add Message
to: "running examples"

 Subscribe Subscribe

This site runs SLAC HyperNews version 1.11-slac-98, derived from the original HyperNews


[ Geant 4 Home | Geant 4 HyperNews | Search | Request New Forum | Feedback ]