Message: Getting error while runing code Not Logged In (login)
 Next-in-Thread Next-in-Thread
 Next-in-Forum Next-in-Forum

None Getting error while runing code 

Forum: Documentation and Examples
Date: 24 Dec, 2012
From: smith <smith>

Hello, In make process when i run make command i am getting this error how i can remove it?? Regards smith

{standard input}: Fatal error: can't write CMakeFiles/hadr01.dir/hadr01.cc.o: No space left on device

{standard input}: Assembler messages: {standard input}: Fatal error: can't write CMakeFiles/hadr01.dir/hadr01.cc.o: No space left on device

as: BFD (GNU Binutils for Ubuntu) 2.22 assertion fail ../../bfd/elf.c:2532
as: BFD (GNU Binutils for Ubuntu) 2.22 assertion fail ../../bfd/elf.c:2532
as: BFD (GNU Binutils for Ubuntu) 2.22 assertion fail ../../bfd/elf.c:2532
as: BFD (GNU Binutils for Ubuntu) 2.22 assertion fail ../../bfd/elf.c:2532
as: BFD (GNU Binutils for Ubuntu) 2.22 assertion fail ../../bfd/elf.c:2532

{standard input}: Fatal error: can't close CMakeFiles/hadr01.dir/hadr01.cc.o: No space left on device make[3]: *** [CMakeFiles/hadr01.dir/hadr01.cc.o] Error 1 make[2]: *** [CMakeFiles/hadr01.dir/all] Error 2 make[1]: *** [CMakeFiles/hadr01.dir/rule] Error 2 make: *** [hadr01] Error 2

Inline Depth:
 1 1
 All All
Outline Depth:
 1 1
 2 2
 All All
Add message: (add)

1 None: Re: Getting error while runing code   (=?UTF-8?B?TmljaG9sYXMgQ29sbGluIFBhdWwgZGUgR2xvdWNlxb90ZXI=?= - 25 Dec, 2012)
 Add Message Add Message
to: "Getting error while runing code"

 Subscribe Subscribe

This site runs SLAC HyperNews version 1.11-slac-98, derived from the original HyperNews


[ Geant 4 Home | Geant 4 HyperNews | Search | Request New Forum | Feedback ]