Message: Error in compiling an example . recipe for target "all" failed Not Logged In (login)
 Next-in-Thread Next-in-Thread
 Next-in-Forum Next-in-Forum

None Error in compiling an example . recipe for target "all" failed 

Forum: Educational Applications
Date: 14 Oct, 2016
From: Shubham <Shubham>

When I try to run the makefile for an example named cyliSD, i am getting the following outcome with error. Can anyone help me in finding the source of error?

[sinha@sinha ~]$ cd /home/sinha/cyliSDbuild
\[sinha@sinha cyliSDbuild]$ make
[  9%] Building CXX object CMakeFiles/cyliSD.dir/src/ExN01PhysicsList.cc.o
/home/sinha/cyliSD/src/ExN01PhysicsList.cc: In constructor ‘ExN01PhysicsList::ExN01PhysicsList()’:
/home/sinha/cyliSD/src/ExN01PhysicsList.cc:41:26: error: ‘mm’ was not declared in this scope
   defaultCutValue = 0.01*mm;
                          ^~
/home/sinha/cyliSD/src/ExN01PhysicsList.cc:41:26: note: suggested alternative:
In file included from /home/sinha/Documents/install/include/Geant4/CLHEP/Units/PhysicalConstants.h:42:0,
                 from /home/sinha/Documents/install/include/Geant4/G4ParticleDefinition.hh:58,
                 from /home/sinha/Documents/install/include/Geant4/G4ParticleTable.hh:58,
                 from /home/sinha/Documents/install/include/Geant4/G4VUserPhysicsList.hh:92,
                 from /home/sinha/cyliSD/include/ExN01PhysicsList.hh:6,
                 from /home/sinha/cyliSD/src/ExN01PhysicsList.cc:2:
/home/sinha/Documents/install/include/Geant4/CLHEP/Units/SystemOfUnits.h:94:23: note:   ‘CLHEP::mm’
   static const double mm  = millimeter;
                       ^~
CMakeFiles/cyliSD.dir/build.make:110: recipe for target 'CMakeFiles/cyliSD.dir/src/ExN01PhysicsList.cc.o' failed
make[2]: *** [CMakeFiles/cyliSD.dir/src/ExN01PhysicsList.cc.o] Error 1
CMakeFiles/Makefile2:99: recipe for target 'CMakeFiles/cyliSD.dir/all' failed
make[1]: *** [CMakeFiles/cyliSD.dir/all] Error 2
Makefile:127: recipe for target 'all' failed
make: *** [all] Error 2

 Add Message Add Message
to: "Error in compiling an example . recipe for target "all" failed"

 Subscribe Subscribe

This site runs SLAC HyperNews version 1.11-slac-98, derived from the original HyperNews


[ Geant 4 Home | Geant 4 HyperNews | Search | Request New Forum | Feedback ]