Message: problem to compil extended example DNA_wholeNuclearDNA Not Logged In (login)
 Next-in-Thread Next-in-Thread
 Next-in-Forum Next-in-Forum

Question problem to compil extended example DNA_wholeNuclearDNA 

Forum: DNA/Very Low Energy
Date: 15 Dec, 2014
From: maxime tomezak <maxime tomezak>

Hello,

I am Novice to use Geant4, and my question is about example compilation. I have a problem to compile extended example DNA_wholeNuclearDNA. I work on virtual station delivered by IN2P3/CNRS last version. I have message below after make : thanks for help me

Maxime T

[root@localhost wholeNuclearDNA-build]# cmake -DGeant4_DIR=$G4DIR ../wholeNuclearDNA -- The C compiler identification is GNU -- The CXX compiler identification is GNU -- Check for working C compiler: /usr/bin/gcc -- Check for working C compiler: /usr/bin/gcc -- works -- Detecting C compiler ABI info -- Detecting C compiler ABI info - done -- Check for working CXX compiler: /usr/bin/c++ -- Check for working CXX compiler: /usr/bin/c++ -- works -- Detecting CXX compiler ABI info -- Detecting CXX compiler ABI info - done -- Configuring done -- Generating done -- Build files have been written to: /home/local1/Desktop/examples-build/wholeNuclearDNA-build [root@localhost wholeNuclearDNA-build]# make -j4 Scanning dependencies of target wholeNuclearDNA [ 10%] [ 20%] [ 30%] Building CXX object CMakeFiles/wholeNuclearDNA.dir/wholeNuclearDNA.cc.o Building CXX object CMakeFiles/wholeNuclearDNA.dir/src/ActionInitialization.cc.o Building CXX object CMakeFiles/wholeNuclearDNA.dir/src/CommandLineParser.cc.o [ 40%] Building CXX object CMakeFiles/wholeNuclearDNA.dir/src/PrimaryGeneratorAction.cc.o [ 50%] Building CXX object CMakeFiles/wholeNuclearDNA.dir/src/SteppingAction.cc.o [ 60%] Building CXX object CMakeFiles/wholeNuclearDNA.dir/src/PhysicsList.cc.o [ 70%] Building CXX object CMakeFiles/wholeNuclearDNA.dir/src/RunAction.cc.o [ 80%] Building CXX object CMakeFiles/wholeNuclearDNA.dir/src/DetectorConstruction.cc.o /home/local1/Desktop/examples-build/wholeNuclearDNA/wholeNuclearDNA.cc: In function ‘int main(int, char**)’: /home/local1/Desktop/examples-build/wholeNuclearDNA/wholeNuclearDNA.cc:174: error: ‘class G4UIQt’ has no member named ‘AddViewerTabFromFile’ /usr/local/clhep/2.1.4.1/include/CLHEP/Units/PhysicalConstants.h: At global scope: /usr/local/clhep/2.1.4.1/include/CLHEP/Units/PhysicalConstants.h:80: warning: ‘CLHEP::electron_charge’ defined but not used /usr/local/clhep/2.1.4.1/include/CLHEP/Random/Randomize.h:70: warning: ‘CLHEP::HepRandomGenActive’ defined but not used [ 90%] Building CXX object CMakeFiles/wholeNuclearDNA.dir/src/ChromosomeParameterisation.cc.o make[2]: *** [CMakeFiles/wholeNuclearDNA.dir/wholeNuclearDNA.cc.o] Error 1 make[2]: *** Waiting for unfinished jobs.... make[1]: *** [CMakeFiles/wholeNuclearDNA.dir/all] Error 2 make: *** [all] Error 2

   Attachment:
      http://hypernews.slac.stanford.edu/HyperNews/geant4/get/AUX/2014/12/15/22.12-83169-ample_wholeNuclearDNA.odt

Inline Depth:
 1 1
 All All
Outline Depth:
 1 1
 2 2
 All All
Add message: (add)

1 None: Re: problem to compil extended example DNA_wholeNuclearDNA   (maxime tomezak - 21 Dec, 2014)
(_ None: Re: problem to compil extended example DNA_wholeNuclearDNA   (Yann Perrot - 26 Jan, 2015)
 Add Message Add Message
to: "problem to compil extended example DNA_wholeNuclearDNA"

 Subscribe Subscribe

This site runs SLAC HyperNews version 1.11-slac-98, derived from the original HyperNews